program: Orca
programVersion: 5.0.2
elementType: Si F O O C C C C C C C C C C C C C C C C C C C C C C C C C H H H H H H H H H H H H H H H H H H H H H H H H H H H H H
charge: 0
multiplicity: 1
keywords: wb97x-d3
keywords: def2-TZVPP
keywords: def2/J RIJCOSX
keywords: DEFGRID2
keywords: scfconv7
keywords: smallprint printgap noloewdin
keywords: NOSOSCF
formula: C25H29FO2Si
InChI: InChI=1/C25H29FO2Si/c1-4-27-21-13-15-23(16-14-21)29(2,3)18-8-9-20-12-17-24(26)25(19-20)28-22-10-6-5-7-11-22/h5-7,10-17,19H,4,8-9,18H2,1-3H3
58 atoms
Si -3.574383 0.762099 0.193898
F  3.410242 -1.143969 0.6155
O  0.589213 1.500635 4.520018
O  2.116264 -2.310213 -1.413672
C  -2.773929 -0.122163 -1.279891
C  -2.052377 0.758915 -2.301155
C  -2.305379 1.049252 1.554819
C  -4.929418 -0.358656 0.87426
C  -4.317423 2.407963 -0.33881
C  -0.898152 1.597092 -1.756107
C  -1.971832 2.31691 2.024027
C  -1.632897 -0.033782 2.135682
C  0.231955 0.838466 -1.108553
C  -1.014349 2.518803 3.013807
C  -0.679015 0.139098 3.119631
C  -0.356889 1.423472 3.565849
C  0.636501 -0.407029 -1.57994
C  0.92418 1.396373 -0.036234
C  1.711226 -1.073433 -1.008413
C  1.989313 0.734096 0.555189
C  2.378388 -0.49178 0.059391
C  0.985236 2.776364 5.004266
C  2.050691 2.564999 6.051543
C  2.197227 -2.58529 -2.753216
C  1.821955 -3.858033 -3.158984
C  2.675491 -1.659684 -3.67308
C  1.929109 -4.206775 -4.497888
C  2.7659 -2.019264 -5.009863
C  2.393733 -3.289221 -5.429925
H  -2.101721 -0.898237 -0.89715
H  -3.57003 -0.669442 -1.796986
H  -2.770216 1.449262 -2.752958
H  -1.693667 0.14055 -3.129954
H  -4.537955 -1.336993 1.162662
H  -5.401334 0.074813 1.758697
H  -5.715174 -0.531117 0.135087
H  -5.047072 2.262019 -1.138751
H  -4.842474 2.89603 0.48528
H  -3.568173 3.109916 -0.71026
H  -0.487666 2.186047 -2.58331
H  -1.277127 2.332335 -1.04079
H  -2.461068 3.193588 1.614485
H  -1.848831 -1.046694 1.811638
H  -0.797333 3.529253 3.333819
H  -0.169157 -0.715678 3.548262
H  0.114132 -0.87339 -2.406925
H  0.624968 2.361216 0.353122
H  2.518371 1.168798 1.393953
H  0.127106 3.303392 5.434999
H  1.37206 3.38989 4.183196
H  1.676747 1.978058 6.891246
H  2.925491 2.061681 5.638293
H  2.374479 3.53113 6.439139
H  1.451823 -4.569235 -2.431048
H  2.977226 -0.668487 -3.358484
H  1.63652 -5.200302 -4.812562
H  3.135933 -1.297376 -5.726594
H  2.468174 -3.561436 -6.474545
elementType: Si F O C H
totalener: -1510.06913287 hartree
nucrepener: 2891.76007941 hartree
electener: -4401.82921228 hartree
oneelecener: -7814.19386741 hartree
twoeener: 3412.36465512 hartree
cpcmener: -0.02443816 hartree
kineticenergy: 1503.89636222 hartree
xcener: -135.231496679950 hartree
chargesum: 0.0000000
charge: 0.483672 -0.218080 -0.325865 -0.331574 -0.271948 -0.140542 -0.108374 -0.454870 -0.441167 -0.083009 -0.165877 -0.104886 0.059892 -0.244215 -0.315684 0.359341 -0.241315 -0.227467 0.201123 -0.179594 0.202928 0.059902 -0.274643 0.269043 -0.242604 -0.174095 -0.123416 -0.149497 -0.184236 0.083103 0.095819 0.090601 0.084371 0.100017 0.100357 0.101149 0.113469 0.111259 0.104072 0.098770 0.078518 0.142519 0.131175 0.134893 0.128956 0.152933 0.143956 0.145522 0.095290 0.093554 0.087736 0.087583 0.088287 0.146168 0.152948 0.157331 0.159066 0.157634
qa: 0.4837 -0.2181 -0.3259 -0.3316 -0.2719 -0.1405 -0.1084 -0.4549 -0.4412 -0.0830 -0.1659 -0.1049 0.0599 -0.2442 -0.3157 0.3593 -0.2413 -0.2275 0.2011 -0.1796 0.2029 0.0599 -0.2746 0.2690 -0.2426 -0.1741 -0.1234 -0.1495 -0.1842 0.0831 0.0958 0.0906 0.0844 0.1000 0.1004 0.1011 0.1135 0.1113 0.1041 0.0988 0.0785 0.1425 0.1312 0.1349 0.1290 0.1529 0.1440 0.1455 0.0953 0.0936 0.0877 0.0876 0.0883 0.1462 0.1529 0.1573 0.1591 0.1576
va: 4.0934 1.0701 2.0705 2.0757 3.8462 3.8945 3.6740 3.9012 3.9140 3.8220 3.8625 3.8330 3.6098 3.8602 4.0059 3.6884 3.8874 3.8828 3.6784 3.8443 4.0718 3.7971 3.9752 3.7133 4.0007 3.8879 3.8877 3.8941 3.9033 1.0126 1.0093 0.9989 1.0017 1.0109 1.0100 1.0112 1.0087 1.0091 1.0071 1.0023 1.0092 0.9901 0.9939 1.0131 1.0164 0.9957 0.9976 1.0003 0.9868 0.9856 1.0034 1.0031 1.0060 1.0077 0.9983 0.9892 0.9905 0.9906
dispcorr: -0.031548038 hartree
energy: -1510.100680907529
dipole: -24.75625 23.98683 -0.76943 16.90797 -15.32491 1.58306 4.08047 -4.75153 -0.67106
magnitude: 1.88372 au
magnitude: 4.78804 debye
