program: Orca
programVersion: 5.0.2
elementType: Si F O O C C C C C C C C C C C C C C C C C C C C C C C C C H H H H H H H H H H H H H H H H H H H H H H H H H H H H H
charge: 0
multiplicity: 1
keywords: wb97x-d3
keywords: def2-TZVPP
keywords: def2/J RIJCOSX
keywords: DEFGRID2
keywords: scfconv7
keywords: smallprint printgap noloewdin
keywords: NOSOSCF
formula: C25H29FO2Si
InChI: InChI=1/C25H29FO2Si/c1-4-27-21-13-15-23(16-14-21)29(2,3)18-8-9-20-12-17-24(26)25(19-20)28-22-10-6-5-7-11-22/h5-7,10-17,19H,4,8-9,18H2,1-3H3
58 atoms
Si -3.070736 0.164305 0.424466
F  3.74489 -0.409472 -0.445202
O  1.348713 2.665648 3.711385
O  2.328058 -2.084172 -1.970161
C  -2.37077 0.149824 -1.328391
C  -2.002049 1.535383 -1.864811
C  -1.751051 0.944429 1.518716
C  -3.382989 -1.609136 0.979149
C  -4.654064 1.174793 0.519242
C  -0.902293 1.516363 -2.938255
C  -1.982985 2.078518 2.292598
C  -0.448837 0.427487 1.535912
C  0.399443 1.031409 -2.365108
C  -0.982514 2.683797 3.047186
C  0.562729 1.010378 2.273977
C  0.304062 2.152897 3.035315
C  0.789312 -0.295554 -2.515129
C  1.186826 1.8732 -1.582419
C  1.908089 -0.792331 -1.859717
C  2.32574 1.399053 -0.950587
C  2.664718 0.068312 -1.07928
C  1.160523 3.840362 4.488295
C  2.491209 4.220505 5.088174
C  1.404837 -3.096399 -1.963316
C  1.667658 -4.19119 -2.774139
C  0.274274 -3.068895 -1.155204
C  0.785931 -5.262691 -2.780523
C  -0.606338 -4.1401 -1.184407
C  -0.358488 -5.239347 -1.995501
H  -1.485539 -0.495142 -1.288421
H  -3.059727 -0.352265 -2.015266
H  -1.665427 2.19154 -1.055237
H  -2.892399 2.013419 -2.281119
H  -3.819301 -1.645954 1.979727
H  -4.068644 -2.127477 0.304643
H  -2.457107 -2.188986 1.009696
H  -5.076554 1.187459 1.526153
H  -4.502409 2.21202 0.213364
H  -5.415044 0.753189 -0.14169
H  -1.209614 0.878756 -3.771082
H  -0.778904 2.525516 -3.339249
H  -2.970923 2.524294 2.320329
H  -0.20433 -0.455026 0.953616
H  -1.225706 3.562865 3.628852
H  1.561927 0.591129 2.263894
H  0.196962 -0.958605 -3.134791
H  0.906603 2.911606 -1.454547
H  2.936273 2.051372 -0.3392
H  0.423036 3.659101 5.277645
H  0.781043 4.65375 3.860399
H  2.881238 3.432013 5.732843
H  3.231414 4.4368 4.317132
H  2.370968 5.11764 5.695668
H  2.555627 -4.203538 -3.393789
H  0.074593 -2.224478 -0.507661
H  0.993513 -6.115532 -3.413912
H  -1.491565 -4.111339 -0.561572
H  -1.050129 -6.07126 -2.013347
elementType: Si F O C H
totalener: -1510.06913661 hartree
nucrepener: 2928.20552140 hartree
electener: -4438.27465801 hartree
oneelecener: -7886.63475753 hartree
twoeener: 3448.36009951 hartree
cpcmener: -0.02470929 hartree
kineticenergy: 1503.91131296 hartree
xcener: -135.231976453407 hartree
chargesum: -0.0000000
charge: 0.462836 -0.219152 -0.325143 -0.331287 -0.199502 -0.153279 -0.293658 -0.414650 -0.450346 -0.083779 -0.071564 -0.009277 0.065379 -0.282594 -0.369153 0.399639 -0.237880 -0.222850 0.221516 -0.194061 0.205862 0.063229 -0.273250 0.182473 -0.189013 -0.085836 -0.157929 -0.217237 -0.144828 0.019239 0.094928 0.078770 0.089599 0.107131 0.103507 0.091445 0.105345 0.104876 0.108365 0.082799 0.094558 0.141796 0.168750 0.135267 0.128940 0.150250 0.140034 0.146743 0.093597 0.090988 0.087034 0.086727 0.088551 0.145139 0.170821 0.157144 0.155386 0.157608
qa: 0.4628 -0.2192 -0.3251 -0.3313 -0.1995 -0.1533 -0.2937 -0.4147 -0.4503 -0.0838 -0.0716 -0.0093 0.0654 -0.2826 -0.3692 0.3996 -0.2379 -0.2228 0.2215 -0.1941 0.2059 0.0632 -0.2732 0.1825 -0.1890 -0.0858 -0.1579 -0.2172 -0.1448 0.0192 0.0949 0.0788 0.0896 0.1071 0.1035 0.0914 0.1053 0.1049 0.1084 0.0828 0.0946 0.1418 0.1687 0.1353 0.1289 0.1503 0.1400 0.1467 0.0936 0.0910 0.0870 0.0867 0.0886 0.1451 0.1708 0.1571 0.1554 0.1576
va: 4.1456 1.0651 2.0817 2.0884 3.8182 3.9108 3.8088 3.8955 3.9295 3.8519 3.8157 3.6574 3.5993 3.9233 4.0470 3.7061 3.8918 3.8482 3.6720 3.8499 4.0271 3.8004 3.9751 3.8201 3.9470 3.7878 3.9212 3.9473 3.8900 1.0370 1.0178 1.0028 1.0085 1.0109 1.0082 1.0114 1.0092 1.0065 1.0098 1.0100 1.0063 0.9884 0.9243 1.0137 1.0192 1.0012 1.0032 0.9994 0.9860 0.9863 1.0036 1.0035 1.0059 1.0069 0.9503 0.9893 0.9968 0.9911
dispcorr: -0.032740393 hartree
energy: -1510.101877001731
dipole: -26.24293 24.62502 -1.61791 13.22234 -12.15359 1.06875 10.20755 -10.17363 0.03391
magnitude: 1.93933 au
magnitude: 4.92940 debye
