program: Orca
programVersion: 5.0.2
elementType: Si F O O C C C C C C C C C C C C C C C C C C C C C C C C C H H H H H H H H H H H H H H H H H H H H H H H H H H H H H
charge: 0
multiplicity: 1
keywords: wb97x-d3
keywords: def2-TZVPP
keywords: def2/J RIJCOSX
keywords: DEFGRID2
keywords: scfconv7
keywords: smallprint printgap noloewdin
keywords: NOSOSCF
formula: C25H29FO2Si
InChI: InChI=1/C25H29FO2Si/c1-4-27-21-13-15-23(16-14-21)29(2,3)18-8-9-20-12-17-24(26)25(19-20)28-22-10-6-5-7-11-22/h5-7,10-17,19H,4,8-9,18H2,1-3H3
58 atoms
Si -3.58794 0.591939 0.195213
F  3.411264 -0.907411 0.596791
O  0.699599 1.374082 4.391147
O  2.100504 -2.149927 -1.36072
C  -2.773144 -0.151741 -1.344915
C  -2.104577 0.819558 -2.320688
C  -2.294779 0.88493 1.531733
C  -4.842252 -0.658989 0.841943
C  -4.455493 2.209158 -0.221994
C  -0.997147 1.697091 -1.742691
C  -2.055313 2.13676 2.091795
C  -1.500323 -0.173391 1.993044
C  0.174462 0.980903 -1.121153
C  -1.071673 2.348187 3.053786
C  -0.518337 0.009497 2.947096
C  -0.288702 1.280145 3.481716
C  0.588742 -0.270926 -1.565999
C  0.886731 1.58518 -0.087263
C  1.686101 -0.903701 -0.998232
C  1.974971 0.957868 0.498893
C  2.36658 -0.280071 0.036375
C  1.015855 2.646361 4.939555
C  2.182312 2.472575 5.879876
C  2.158333 -2.50233 -2.681542
C  1.889001 -3.830918 -2.981326
C  2.519143 -1.609297 -3.683326
C  1.983262 -4.268346 -4.29421
C  2.596757 -2.059558 -4.993737
C  2.330622 -3.385365 -5.307368
H  -2.064204 -0.920698 -1.018874
H  -3.551989 -0.700271 -1.886466
H  -2.862776 1.488987 -2.736141
H  -1.715985 0.263182 -3.179665
H  -5.628145 -0.853561 0.108364
H  -4.372011 -1.617641 1.073172
H  -5.326761 -0.307466 1.755408
H  -3.765479 2.977757 -0.576019
H  -5.199041 2.056995 -1.007851
H  -4.985021 2.617671 0.64159
H  -0.62203 2.339992 -2.546275
H  -1.415726 2.382455 -1.000295
H  -2.640189 2.99363 1.776377
H  -1.63735 -1.172731 1.592856
H  -0.931574 3.345908 3.447874
H  0.089211 -0.824542 3.277841
H  0.054155 -0.770516 -2.365023
H  0.580264 2.556476 0.280134
H  2.517009 1.425641 1.311083
H  0.151894 3.055173 5.474533
H  1.273495 3.349833 4.140345
H  1.94267 1.790661 6.696424
H  3.063805 2.09603 5.359661
H  2.44061 3.437092 6.317463
H  1.611097 -4.51598 -2.190057
H  2.742513 -0.574821 -3.455114
H  1.773933 -5.305189 -4.524082
H  2.876492 -1.363399 -5.773991
H  2.396703 -3.727588 -6.331718
elementType: Si F O C H
totalener: -1510.06887514 hartree
nucrepener: 2909.81616403 hartree
electener: -4419.88503918 hartree
oneelecener: -7850.35880598 hartree
twoeener: 3430.47376681 hartree
cpcmener: -0.02448995 hartree
kineticenergy: 1503.89743350 hartree
xcener: -135.232759489825 hartree
chargesum: 0.0000000
charge: 0.482904 -0.218426 -0.326742 -0.329844 -0.277155 -0.140958 -0.106169 -0.451697 -0.440865 -0.082371 -0.162467 -0.111092 0.046520 -0.244722 -0.317546 0.361034 -0.248476 -0.213011 0.221415 -0.184996 0.201539 0.060129 -0.273572 0.291480 -0.253192 -0.192544 -0.118277 -0.145532 -0.189950 0.085454 0.096048 0.091226 0.083843 0.100648 0.100245 0.100667 0.104314 0.113129 0.110961 0.099223 0.077799 0.142967 0.131261 0.134522 0.130351 0.153848 0.140446 0.142941 0.096351 0.091822 0.087022 0.087633 0.088583 0.145578 0.153795 0.157179 0.159256 0.157473
qa: 0.4829 -0.2184 -0.3267 -0.3298 -0.2772 -0.1410 -0.1062 -0.4517 -0.4409 -0.0824 -0.1625 -0.1111 0.0465 -0.2447 -0.3175 0.3610 -0.2485 -0.2130 0.2214 -0.1850 0.2015 0.0601 -0.2736 0.2915 -0.2532 -0.1925 -0.1183 -0.1455 -0.1899 0.0855 0.0960 0.0912 0.0838 0.1006 0.1002 0.1007 0.1043 0.1131 0.1110 0.0992 0.0778 0.1430 0.1313 0.1345 0.1304 0.1538 0.1404 0.1429 0.0964 0.0918 0.0870 0.0876 0.0886 0.1456 0.1538 0.1572 0.1593 0.1575
va: 4.0994 1.0694 2.0687 2.0806 3.8410 3.8918 3.6746 3.9010 3.9126 3.8281 3.8701 3.8341 3.6238 3.8636 3.9992 3.6843 3.8842 3.8660 3.6686 3.8415 4.0605 3.7965 3.9760 3.6976 4.0045 3.8937 3.8845 3.8911 3.9082 1.0113 1.0102 0.9983 1.0015 1.0112 1.0107 1.0098 1.0069 1.0088 1.0089 1.0021 1.0088 0.9900 0.9942 1.0135 1.0157 0.9937 0.9997 1.0022 0.9869 0.9858 1.0035 1.0031 1.0059 1.0086 0.9985 0.9892 0.9903 0.9908
dispcorr: -0.032018746 hartree
energy: -1510.100893887290
dipole: -24.86945 24.02689 -0.84256 15.24182 -13.70355 1.53826 4.02418 -4.64604 -0.62185
magnitude: 1.86088 au
magnitude: 4.72997 debye
