program: Orca
programVersion: 5.0.2
elementType: Si F O O C C C C C C C C C C C C C C C C C C C C C C C C C H H H H H H H H H H H H H H H H H H H H H H H H H H H H H
charge: 0
multiplicity: 1
keywords: wb97x-d3
keywords: def2-TZVPP
keywords: def2/J RIJCOSX
keywords: DEFGRID2
keywords: scfconv7
keywords: smallprint printgap noloewdin
keywords: NOSOSCF
formula: C25H29FO2Si
InChI: InChI=1/C25H29FO2Si/c1-4-27-21-13-15-23(16-14-21)29(2,3)18-8-9-20-12-17-24(26)25(19-20)28-22-10-6-5-7-11-22/h5-7,10-17,19H,4,8-9,18H2,1-3H3
58 atoms
Si -4.025376 0.9098 0.830974
F  1.415824 -1.672634 -3.038075
O  1.697096 2.863157 0.593904
O  1.748845 -0.203377 -0.733379
C  -4.164845 -0.735576 -0.099964
C  -3.80169 -2.005638 0.671777
C  -2.25685 1.548364 0.821226
C  -4.621191 0.704029 2.604548
C  -5.104467 2.165213 -0.069991
C  -2.345406 -2.102404 1.127987
C  -1.508845 1.722995 1.981948
C  -1.618858 1.853864 -0.387795
C  -1.331274 -2.017597 0.017029
C  -0.188162 2.161421 1.960895
C  -0.311125 2.295162 -0.435504
C  0.425036 2.442521 0.742813
C  -0.210626 -1.203358 0.150342
C  -1.478004 -2.749764 -1.15924
C  0.722459 -1.090338 -0.867227
C  -0.550626 -2.649521 -2.186142
C  0.531608 -1.809073 -2.038467
C  2.545666 2.980226 1.729557
C  3.088689 1.650317 2.207693
C  3.042039 -0.615722 -0.893664
C  3.948518 0.35392 -1.303219
C  3.46276 -1.910089 -0.620635
C  5.285427 0.019389 -1.449936
C  4.804905 -2.230447 -0.778601
C  5.720545 -1.275082 -1.195405
H  -5.206766 -0.819363 -0.429762
H  -3.581951 -0.671239 -1.025525
H  -4.044138 -2.881602 0.062267
H  -4.435781 -2.089593 1.558801
H  -4.610262 1.65184 3.14698
H  -5.650067 0.336907 2.623513
H  -4.016044 -0.005317 3.172739
H  -5.046474 3.152285 0.393647
H  -4.802469 2.279865 -1.113833
H  -6.154713 1.864112 -0.070458
H  -2.130313 -1.322503 1.863071
H  -2.215859 -3.051218 1.658839
H  -1.948894 1.50664 2.949203
H  -2.149816 1.741214 -1.327514
H  0.337582 2.26592 2.90052
H  0.159218 2.514902 -1.386625
H  -0.06468 -0.620774 1.052623
H  -2.330392 -3.403884 -1.292716
H  -0.675551 -3.208632 -3.104813
H  2.038426 3.516045 2.537553
H  3.367515 3.616182 1.399513
H  3.687021 1.167122 1.434792
H  3.73617 1.818717 3.069556
H  2.305426 0.957551 2.516683
H  3.604173 1.361896 -1.500046
H  2.764441 -2.666279 -0.283056
H  5.988655 0.77649 -1.772505
H  5.133067 -3.240332 -0.568058
H  6.763853 -1.534763 -1.316978
elementType: Si F O C H
totalener: -1510.06683123 hartree
nucrepener: 3017.38125534 hartree
electener: -4527.44808657 hartree
oneelecener: -8065.98319831 hartree
twoeener: 3538.53511175 hartree
cpcmener: -0.02302770 hartree
kineticenergy: 1503.91518919 hartree
xcener: -135.236910269556 hartree
chargesum: -0.0000000
charge: 0.484250 -0.219024 -0.336880 -0.300958 -0.262678 -0.162826 -0.133226 -0.442983 -0.451371 -0.083502 -0.163073 -0.085977 0.049312 -0.239863 -0.313108 0.352338 -0.221048 -0.214757 0.136227 -0.163285 0.253456 0.039953 -0.278089 0.285023 -0.285880 -0.182088 -0.099453 -0.150857 -0.192350 0.097238 0.079531 0.090081 0.088784 0.111986 0.113226 0.102016 0.099941 0.099779 0.101108 0.082089 0.098292 0.142318 0.130945 0.135638 0.129955 0.139579 0.140988 0.147090 0.092158 0.110485 0.089921 0.104564 0.091417 0.140179 0.152114 0.156891 0.157768 0.156637
qa: 0.4843 -0.2190 -0.3369 -0.3010 -0.2627 -0.1628 -0.1332 -0.4430 -0.4514 -0.0835 -0.1631 -0.0860 0.0493 -0.2399 -0.3131 0.3523 -0.2210 -0.2148 0.1362 -0.1633 0.2535 0.0400 -0.2781 0.2850 -0.2859 -0.1821 -0.0995 -0.1509 -0.1924 0.0972 0.0795 0.0901 0.0888 0.1120 0.1132 0.1020 0.0999 0.0998 0.1011 0.0821 0.0983 0.1423 0.1309 0.1356 0.1300 0.1396 0.1410 0.1471 0.0922 0.1105 0.0899 0.1046 0.0914 0.1402 0.1521 0.1569 0.1578 0.1566
va: 4.1088 1.0664 2.0533 2.0415 3.8453 3.9028 3.6751 3.9153 3.9016 3.8053 3.8544 3.8105 3.6140 3.8760 3.9877 3.6736 3.9482 3.8878 3.7066 3.9233 3.9940 3.8411 3.9181 3.6037 3.9627 3.9093 3.8677 3.9135 3.9084 1.0071 1.0149 1.0009 1.0009 1.0090 1.0079 1.0065 1.0099 1.0108 1.0106 1.0099 1.0044 0.9898 0.9939 1.0064 1.0156 0.9997 1.0021 0.9992 0.9976 0.9921 1.0014 1.0129 1.0019 1.0219 1.0036 0.9894 0.9906 0.9909
dispcorr: -0.035775523 hartree
energy: -1510.102606752444
dipole: -18.94187 18.62942 -0.31245 5.50785 -6.17764 -0.66978 19.68634 -18.41104 1.27531
magnitude: 1.47399 au
magnitude: 3.74659 debye
