program: Orca
programVersion: 5.0.2
elementType: Si F O O C C C C C C C C C C C C C C C C C C C C C C C C C H H H H H H H H H H H H H H H H H H H H H H H H H H H H H
charge: 0
multiplicity: 1
keywords: wb97x-d3
keywords: def2-TZVPP
keywords: def2/J RIJCOSX
keywords: DEFGRID2
keywords: scfconv7
keywords: smallprint printgap noloewdin
keywords: NOSOSCF
formula: C25H29FO2Si
InChI: InChI=1/C25H29FO2Si/c1-4-27-21-13-15-23(16-14-21)29(2,3)18-8-9-20-12-17-24(26)25(19-20)28-22-10-6-5-7-11-22/h5-7,10-17,19H,4,8-9,18H2,1-3H3
58 atoms
Si -2.516771 1.713663 -0.451451
F  1.146909 -5.142104 -1.687615
O  2.413153 3.07134 2.783238
O  1.775892 -2.728697 -0.642512
C  -2.706057 -0.165863 -0.378129
C  -2.690881 -0.742154 1.036964
C  -1.001001 2.196869 0.554244
C  -4.037355 2.55734 0.268012
C  -2.277968 2.228394 -2.24759
C  -2.8127 -2.264232 1.100287
C  0.232292 1.566114 0.343613
C  -1.045585 3.164747 1.554787
C  -1.741923 -3.030179 0.36571
C  1.350511 1.880884 1.092086
C  0.067158 3.503057 2.318192
C  1.277608 2.854151 2.092294
C  -0.454871 -2.523612 0.216237
C  -2.020628 -4.283413 -0.177659
C  0.514847 -3.229244 -0.478742
C  -1.051517 -5.012421 -0.850117
C  0.207611 -4.471091 -1.007862
C  2.467084 4.087402 3.775981
C  2.620445 5.475467 3.191651
C  1.924939 -1.590718 -1.38799
C  1.031924 -1.219751 -2.38647
C  3.046407 -0.816161 -1.119938
C  1.272581 -0.06135 -3.113539
C  3.273997 0.33524 -1.858396
C  2.387119 0.723003 -2.853793
H  -3.637433 -0.445753 -0.884395
H  -1.905538 -0.606315 -0.982539
H  -3.519985 -0.322491 1.613872
H  -1.786606 -0.424059 1.563574
H  -3.9743 3.645722 0.206223
H  -4.933701 2.258572 -0.281015
H  -4.2004 2.296883 1.315821
H  -3.116583 1.910581 -2.871773
H  -2.188036 3.312156 -2.34791
H  -1.372717 1.78638 -2.670563
H  -2.810931 -2.572795 2.151189
H  -3.786606 -2.565397 0.70501
H  0.331621 0.801458 -0.420715
H  -1.972738 3.686098 1.764403
H  2.290597 1.372666 0.913197
H  -0.036624 4.264909 3.079122
H  -0.188599 -1.556528 0.627455
H  -3.015257 -4.700862 -0.079047
H  -1.277964 -5.984392 -1.269729
H  3.342428 3.841867 4.37783
H  1.600635 4.028868 4.441691
H  3.513925 5.542906 2.569955
H  1.762792 5.779009 2.590816
H  2.725131 6.197071 4.003105
H  0.159566 -1.820715 -2.610077
H  3.734463 -1.115728 -0.339202
H  0.577066 0.223276 -3.892779
H  4.147569 0.937639 -1.644643
H  2.56447 1.625628 -3.423315
elementType: Si F O C H
totalener: -1510.06787856 hartree
nucrepener: 2926.87931098 hartree
electener: -4436.94718954 hartree
oneelecener: -7884.08505785 hartree
twoeener: 3447.13786831 hartree
cpcmener: -0.02324853 hartree
kineticenergy: 1503.90865583 hartree
xcener: -135.233757532709 hartree
chargesum: -0.0000000
charge: 0.449643 -0.216561 -0.332840 -0.334589 -0.277192 -0.100576 -0.229815 -0.445464 -0.404752 -0.116803 -0.026651 -0.074965 0.016710 -0.283783 -0.275730 0.349621 -0.207851 -0.182149 0.178109 -0.180567 0.213466 0.043493 -0.259744 0.282789 -0.153816 -0.227589 -0.173084 -0.143203 -0.177152 0.093580 0.078799 0.092238 0.079054 0.104554 0.108921 0.104730 0.101465 0.102361 0.092948 0.093275 0.083923 0.076439 0.142943 0.130469 0.136403 0.153542 0.139535 0.147678 0.107443 0.084805 0.088415 0.090171 0.092565 0.147175 0.145579 0.160191 0.156076 0.155769
qa: 0.4496 -0.2166 -0.3328 -0.3346 -0.2772 -0.1006 -0.2298 -0.4455 -0.4048 -0.1168 -0.0267 -0.0750 0.0167 -0.2838 -0.2757 0.3496 -0.2079 -0.1821 0.1781 -0.1806 0.2135 0.0435 -0.2597 0.2828 -0.1538 -0.2276 -0.1731 -0.1432 -0.1772 0.0936 0.0788 0.0922 0.0791 0.1046 0.1089 0.1047 0.1015 0.1024 0.0929 0.0933 0.0839 0.0764 0.1429 0.1305 0.1364 0.1535 0.1395 0.1477 0.1074 0.0848 0.0884 0.0902 0.0926 0.1472 0.1456 0.1602 0.1561 0.1558
va: 4.1430 1.0708 2.0810 2.0845 3.8496 3.8471 3.7878 3.9234 3.8866 3.8701 3.7782 3.7800 3.6712 4.0191 3.9050 3.8121 3.8959 3.9167 3.6971 3.8823 4.0565 3.8656 3.9116 3.6612 3.7922 3.9227 3.8621 3.8690 3.8722 1.0178 1.0108 1.0042 1.0032 1.0089 1.0088 1.0074 1.0093 1.0100 1.0136 1.0014 1.0051 0.9936 0.9875 1.0259 1.0084 1.0005 1.0002 0.9983 0.9924 0.9962 1.0054 1.0027 1.0091 1.0051 1.0078 0.9898 0.9897 0.9911
dispcorr: -0.033153458 hartree
energy: -1510.101032014611
dipole: -16.71880 15.38523 -1.33357 34.02893 -32.68761 1.34132 9.42346 -8.63367 0.78979
magnitude: 2.04971 au
magnitude: 5.20994 debye
