program: Orca
programVersion: 5.0.2
elementType: Si F O O C C C C C C C C C C C C C C C C C C C C C C C C C H H H H H H H H H H H H H H H H H H H H H H H H H H H H H
charge: 0
multiplicity: 1
keywords: wb97x-d3
keywords: def2-TZVPP
keywords: def2/J RIJCOSX
keywords: DEFGRID2
keywords: scfconv7
keywords: smallprint printgap noloewdin
keywords: NOSOSCF
formula: C25H29FO2Si
InChI: InChI=1/C25H29FO2Si/c1-4-27-21-13-15-23(16-14-21)29(2,3)18-8-9-20-12-17-24(26)25(19-20)28-22-10-6-5-7-11-22/h5-7,10-17,19H,4,8-9,18H2,1-3H3
58 atoms
Si -4.047228 1.77227 0.482643
F  2.21094 -4.277181 0.297915
O  1.877578 2.932062 0.648346
O  2.07183 -2.216399 -1.468182
C  -4.053386 0.160357 -0.522032
C  -2.90334 -0.762587 -0.129967
C  -2.250536 2.32228 0.596539
C  -4.720355 1.453156 2.211211
C  -5.076618 3.078225 -0.396488
C  -2.781612 -2.037308 -0.971378
C  -1.625552 2.991623 -0.454816
C  -1.429777 1.915795 1.654811
C  -1.471577 -2.715875 -0.685271
C  -0.255404 3.226081 -0.481643
C  -0.063926 2.133114 1.649598
C  0.541849 2.778559 0.569976
C  -0.298969 -2.185745 -1.223285
C  -1.371578 -3.793596 0.186938
C  0.934966 -2.713798 -0.897426
C  -0.135571 -4.334298 0.524407
C  1.004761 -3.785342 -0.017057
C  2.604339 3.45521 -0.457218
C  2.768477 2.463361 -1.589275
C  2.926554 -1.475945 -0.698136
C  2.551382 -0.876216 0.49732
C  4.216162 -1.321872 -1.193652
C  3.48782 -0.128439 1.200802
C  5.136343 -0.57104 -0.480379
C  4.780971 0.024915 0.723542
H  -5.018125 -0.346207 -0.407351
H  -3.970648 0.414376 -1.585142
H  -2.980326 -1.044646 0.925505
H  -1.962892 -0.213435 -0.220978
H  -4.647772 2.337992 2.847038
H  -5.774691 1.16996 2.167156
H  -4.194377 0.641748 2.718642
H  -5.067771 4.029976 0.138696
H  -4.714408 3.268053 -1.409107
H  -6.11945 2.764416 -0.484286
H  -3.616307 -2.711362 -0.765671
H  -2.838534 -1.774274 -2.031404
H  -2.208053 3.338181 -1.302016
H  -1.856363 1.396889 2.506142
H  0.166077 3.746289 -1.331411
H  0.546491 1.797719 2.479902
H  -0.341166 -1.343123 -1.904549
H  -2.267728 -4.221318 0.619298
H  -0.061563 -5.173481 1.204402
H  3.581938 3.710572 -0.047729
H  2.155453 4.389316 -0.809217
H  3.2750 1.558656 -1.251981
H  1.820753 2.175251 -2.044433
H  3.383195 2.914128 -2.369915
H  1.545068 -0.973869 0.885302
H  4.493129 -1.792645 -2.12884
H  3.194904 0.336289 2.133416
H  6.14092 -0.458139 -0.867545
H  5.503716 0.607026 1.279777
elementType: Si F O C H
totalener: -1510.06801651 hartree
nucrepener: 2929.43805853 hartree
electener: -4439.50607503 hartree
oneelecener: -7889.44334438 hartree
twoeener: 3449.93726935 hartree
cpcmener: -0.02345353 hartree
kineticenergy: 1503.91120420 hartree
xcener: -135.230287676011 hartree
chargesum: 0.0000000
charge: 0.499421 -0.217600 -0.334972 -0.331460 -0.257310 -0.131596 -0.185989 -0.422056 -0.451147 -0.071640 -0.125611 -0.075171 0.034812 -0.266540 -0.321162 0.354892 -0.236201 -0.186091 0.156330 -0.174288 0.248003 0.032001 -0.230932 0.284266 -0.165943 -0.226890 -0.190642 -0.119440 -0.182259 0.081372 0.080481 0.092424 0.069663 0.109260 0.106657 0.098045 0.104411 0.098987 0.103309 0.084363 0.086146 0.135017 0.138028 0.139796 0.137324 0.135951 0.141605 0.148459 0.111562 0.096634 0.036639 0.096891 0.101325 0.149252 0.143542 0.158953 0.154066 0.155053
qa: 0.4994 -0.2176 -0.3350 -0.3315 -0.2573 -0.1316 -0.1860 -0.4221 -0.4511 -0.0716 -0.1256 -0.0752 0.0348 -0.2665 -0.3212 0.3549 -0.2362 -0.1861 0.1563 -0.1743 0.2480 0.0320 -0.2309 0.2843 -0.1659 -0.2269 -0.1906 -0.1194 -0.1823 0.0814 0.0805 0.0924 0.0697 0.1093 0.1067 0.0980 0.1044 0.0990 0.1033 0.0844 0.0861 0.1350 0.1380 0.1398 0.1373 0.1360 0.1416 0.1485 0.1116 0.0966 0.0366 0.0969 0.1013 0.1493 0.1435 0.1590 0.1541 0.1551
va: 4.1223 1.0684 2.0547 2.0719 3.8296 3.8691 3.7390 3.8924 3.9134 3.8118 3.8953 3.8148 3.6580 3.9225 4.0289 3.7148 3.9727 3.9085 3.7442 3.9100 4.0050 3.8433 3.9137 3.6719 3.8075 3.9614 3.8716 3.8795 3.8723 1.0170 1.0148 1.0058 1.0068 1.0068 1.0099 1.0105 1.0100 1.0121 1.0102 1.0123 1.0092 0.9931 0.9904 1.0051 1.0104 1.0129 1.0025 0.9987 0.9934 0.9983 1.0189 1.0032 1.0142 1.0054 1.0097 0.9938 0.9902 0.9921
dispcorr: -0.032408729 hartree
energy: -1510.100425234846
dipole: -22.22557 21.37149 -0.85408 23.64308 -22.94657 0.69651 -1.33460 0.96156 -0.37305
magnitude: 1.16350 au
magnitude: 2.95738 debye
