program: Orca
programVersion: 5.0.2
elementType: Si F O O C C C C C C C C C C C C C C C C C C C C C C C C C H H H H H H H H H H H H H H H H H H H H H H H H H H H H H
charge: 0
multiplicity: 1
keywords: wb97x-d3
keywords: def2-TZVPP
keywords: def2/J RIJCOSX
keywords: DEFGRID2
keywords: scfconv7
keywords: smallprint printgap noloewdin
keywords: NOSOSCF
formula: C25H29FO2Si
InChI: InChI=1/C25H29FO2Si/c1-4-27-21-13-15-23(16-14-21)29(2,3)18-8-9-20-12-17-24(26)25(19-20)28-22-10-6-5-7-11-22/h5-7,10-17,19H,4,8-9,18H2,1-3H3
58 atoms
Si -3.689258 1.048129 1.099357
F  1.934921 -3.649329 -0.775761
O  1.834621 2.88278 -0.558386
O  1.720981 -0.971689 -1.39861
C  -3.78047 -0.847532 1.113699
C  -4.151797 -1.516755 -0.209289
C  -1.978302 1.631397 0.575795
C  -3.997943 1.659425 2.855837
C  -4.987147 1.765979 -0.059477
C  -3.15052 -1.307682 -1.344484
C  -0.877181 1.37605 1.392678
C  -1.729171 2.318401 -0.616338
C  -1.793556 -1.922697 -1.121406
C  0.40945 1.77827 1.059175
C  -0.454706 2.721094 -0.976987
C  0.629929 2.453327 -0.139746
C  -0.636817 -1.160277 -1.256688
C  -1.659479 -3.278194 -0.827118
C  0.619777 -1.734012 -1.14228
C  -0.408786 -3.862941 -0.694447
C  0.719497 -3.090204 -0.867845
C  2.942197 2.795328 0.330265
C  4.153406 3.354652 -0.372468
C  2.723129 -0.861905 -0.476354
C  3.959346 -0.458999 -0.96664
C  2.54124 -1.091713 0.881107
C  5.020648 -0.290171 -0.091259
C  3.616131 -0.922092 1.744167
C  4.857256 -0.523871 1.268248
H  -2.831849 -1.246555 1.490654
H  -4.525988 -1.126312 1.866775
H  -5.122285 -1.142408 -0.547141
H  -4.295312 -2.590185 -0.05125
H  -4.997583 1.386505 3.202176
H  -3.284881 1.2347 3.566231
H  -3.914082 2.746229 2.92234
H  -5.989067 1.44044 0.229605
H  -4.985744 2.857944 -0.031043
H  -4.839384 1.466751 -1.099076
H  -3.575279 -1.734701 -2.258379
H  -3.030167 -0.240483 -1.54678
H  -1.007432 0.848402 2.332024
H  -2.544977 2.550868 -1.291786
H  1.219511 1.55937 1.741316
H  -0.289883 3.252009 -1.907177
H  -0.702399 -0.102091 -1.482207
H  -2.538456 -3.90084 -0.716114
H  -0.307951 -4.919303 -0.479798
H  3.121335 1.756443 0.620361
H  2.73353 3.362573 1.244292
H  4.3869 2.795496 -1.279356
H  4.017457 4.403973 -0.637504
H  5.016196 3.287576 0.290645
H  4.084733 -0.279987 -2.0274
H  1.576977 -1.385888 1.276897
H  5.981852 0.022899 -0.478303
H  3.473004 -1.100929 2.802256
H  5.688141 -0.395754 1.949336
elementType: Si F O C H
totalener: -1510.07017245 hartree
nucrepener: 3022.84335795 hartree
electener: -4532.91353039 hartree
oneelecener: -8076.33938964 hartree
twoeener: 3543.42585924 hartree
cpcmener: -0.02196694 hartree
kineticenergy: 1503.91285190 hartree
xcener: -135.236636399359 hartree
chargesum: 0.0000000
charge: 0.486569 -0.217560 -0.326858 -0.322366 -0.261067 -0.158164 -0.110168 -0.460341 -0.440801 -0.086050 -0.152880 -0.112966 -0.011176 -0.274358 -0.278888 0.347625 -0.229852 -0.167698 0.152203 -0.189586 0.272510 0.085018 -0.286443 0.338161 -0.273187 -0.208192 -0.125431 -0.142976 -0.179255 0.080415 0.096310 0.088346 0.091730 0.101968 0.099823 0.100012 0.112408 0.113701 0.102776 0.102075 0.078426 0.130047 0.139195 0.135018 0.128881 0.155264 0.139635 0.146561 0.033097 0.119509 0.087784 0.098949 0.092701 0.141012 0.150510 0.155195 0.156463 0.156365
qa: 0.4866 -0.2176 -0.3269 -0.3224 -0.2611 -0.1582 -0.1102 -0.4603 -0.4408 -0.0861 -0.1529 -0.1130 -0.0112 -0.2744 -0.2789 0.3476 -0.2299 -0.1677 0.1522 -0.1896 0.2725 0.0850 -0.2864 0.3382 -0.2732 -0.2082 -0.1254 -0.1430 -0.1793 0.0804 0.0963 0.0883 0.0917 0.1020 0.0998 0.1000 0.1124 0.1137 0.1028 0.1021 0.0784 0.1300 0.1392 0.1350 0.1289 0.1553 0.1396 0.1466 0.0331 0.1195 0.0878 0.0989 0.0927 0.1410 0.1505 0.1552 0.1565 0.1564
va: 4.0813 1.0680 2.0638 2.0530 3.8353 3.9028 3.6424 3.9026 3.9108 3.7914 3.8935 3.8179 3.6837 3.8720 4.0176 3.7006 3.8953 3.8876 3.7765 3.9401 3.9403 3.7790 3.9636 3.5206 3.9484 3.8346 3.8415 3.8915 3.8699 1.0160 1.0059 1.0006 1.0025 1.0110 1.0115 1.0108 1.0081 1.0090 1.0076 1.0041 1.0158 0.9987 0.9895 1.0099 1.0161 0.9977 1.0035 1.0006 0.9873 0.9979 1.0036 1.0069 1.0049 1.0134 1.0070 0.9909 0.9911 0.9906
dispcorr: -0.036320156 hartree
energy: -1510.106492604215
dipole: -18.15513 17.61181 -0.54332 17.66418 -17.74047 -0.07629 10.03061 -9.14268 0.88793
magnitude: 1.04376 au
magnitude: 2.65302 debye
