program: Orca
programVersion: 5.0.2
elementType: Si F O O C C C C C C C C C C C C C C C C C C C C C C C C C H H H H H H H H H H H H H H H H H H H H H H H H H H H H H
charge: 0
multiplicity: 1
keywords: wb97x-d3
keywords: def2-TZVPP
keywords: def2/J RIJCOSX
keywords: DEFGRID2
keywords: scfconv7
keywords: smallprint printgap noloewdin
keywords: NOSOSCF
formula: C25H29FO2Si
InChI: InChI=1/C25H29FO2Si/c1-4-27-21-13-15-23(16-14-21)29(2,3)18-8-9-20-12-17-24(26)25(19-20)28-22-10-6-5-7-11-22/h5-7,10-17,19H,4,8-9,18H2,1-3H3
58 atoms
Si -3.640728 1.869787 0.380924
F  1.414136 -5.096525 -2.140579
O  2.203609 3.407392 0.775921
O  2.052262 -2.771563 -1.080032
C  -3.717194 0.042137 0.857408
C  -2.828859 -0.844727 -0.015516
C  -1.832547 2.394666 0.483729
C  -4.677435 2.877948 1.586827
C  -4.259563 2.132746 -1.376887
C  -2.550559 -2.214105 0.608269
C  -1.013382 1.973035 1.539876
C  -1.232151 3.187779 -0.491135
C  -1.512629 -3.00614 -0.139371
C  0.322657 2.318571 1.616555
C  0.109364 3.553005 -0.435825
C  0.898229 3.116505 0.624508
C  -0.215983 -2.498924 -0.244435
C  -1.802985 -4.229241 -0.728939
C  0.774807 -3.200539 -0.909574
C  -0.819266 -4.940288 -1.408389
C  0.452171 -4.424151 -1.48971
C  2.860351 4.183279 -0.217661
C  4.302706 4.34549 0.193052
C  2.554178 -1.763022 -0.296279
C  2.579227 -1.863472 1.088696
C  3.096917 -0.662328 -0.940308
C  3.146831 -0.837021 1.82908
C  3.675626 0.350489 -0.187925
C  3.696491 0.271083 1.197322
H  -3.403966 -0.040648 1.905255
H  -4.753902 -0.309811 0.83678
H  -1.872239 -0.345412 -0.194975
H  -3.283629 -0.979059 -1.000996
H  -5.726276 2.572582 1.56805
H  -4.322833 2.760139 2.613388
H  -4.643325 3.94395 1.351839
H  -4.253853 3.187319 -1.660591
H  -3.65969 1.592257 -2.111784
H  -5.289356 1.781869 -1.478019
H  -2.207332 -2.060804 1.636478
H  -3.477363 -2.788962 0.676305
H  -1.41985 1.348092 2.328246
H  -1.811789 3.542284 -1.336183
H  0.932663 1.972797 2.442808
H  0.51545 4.170722 -1.225625
H  0.016106 -1.542378 0.208436
H  -2.801385 -4.642223 -0.658897
H  -1.040497 -5.8953 -1.868025
H  2.380922 5.163606 -0.311533
H  2.792779 3.687768 -1.192154
H  4.391969 4.85609 1.15255
H  4.81358 3.384234 0.263516
H  4.82522 4.944994 -0.552569
H  2.161544 -2.729484 1.587134
H  3.074384 -0.603955 -2.021248
H  3.162406 -0.909387 2.908918
H  4.111072 1.203969 -0.691608
H  4.143092 1.063753 1.783025
elementType: Si F O C H
totalener: -1510.07071443 hartree
nucrepener: 2880.16122870 hartree
electener: -4390.23194312 hartree
oneelecener: -7790.72749565 hartree
twoeener: 3400.49555253 hartree
cpcmener: -0.02482234 hartree
kineticenergy: 1503.90193981 hartree
xcener: -135.227483972196 hartree
chargesum: -0.0000000
charge: 0.486073 -0.219463 -0.323360 -0.325352 -0.280342 -0.136921 -0.177955 -0.415221 -0.443744 -0.052295 -0.098891 -0.131683 -0.008481 -0.287915 -0.251587 0.342928 -0.229127 -0.209482 0.242302 -0.151928 0.162664 0.026655 -0.274088 0.280779 -0.199824 -0.228968 -0.135382 -0.112116 -0.197881 0.078158 0.093242 0.075180 0.092768 0.101048 0.100024 0.100353 0.104381 0.109320 0.110048 0.089379 0.081144 0.133867 0.138150 0.132815 0.136777 0.134366 0.137715 0.146295 0.109645 0.100794 0.092569 0.082910 0.094890 0.156695 0.145198 0.159023 0.158568 0.155284
qa: 0.4861 -0.2195 -0.3234 -0.3254 -0.2803 -0.1369 -0.1780 -0.4152 -0.4437 -0.0523 -0.0989 -0.1317 -0.0085 -0.2879 -0.2516 0.3429 -0.2291 -0.2095 0.2423 -0.1519 0.1627 0.0267 -0.2741 0.2808 -0.1998 -0.2290 -0.1354 -0.1121 -0.1979 0.0782 0.0932 0.0752 0.0928 0.1010 0.1000 0.1004 0.1044 0.1093 0.1100 0.0894 0.0811 0.1339 0.1382 0.1328 0.1368 0.1344 0.1377 0.1463 0.1096 0.1008 0.0926 0.0829 0.0949 0.1567 0.1452 0.1590 0.1586 0.1553
va: 4.1369 1.0643 2.0596 2.0811 3.8523 3.8560 3.7332 3.8964 3.9071 3.7701 3.8252 3.9033 3.7382 4.0065 3.9245 3.7258 3.9075 3.9092 3.6696 3.8810 4.0443 3.8028 3.9681 3.6903 3.9322 4.0490 3.8794 3.8180 3.8687 1.0160 1.0160 1.0016 1.0094 1.0091 1.0090 1.0098 1.0082 1.0048 1.0082 1.0057 1.0139 0.9915 0.9904 1.0152 1.0119 1.0068 1.0051 0.9992 0.9894 0.9840 1.0029 1.0018 1.0062 0.9954 1.0073 0.9896 0.9837 0.9951
dispcorr: -0.030665136 hartree
energy: -1510.101379563879
dipole: -16.65878 16.09127 -0.56750 31.35840 -30.00290 1.35550 8.15575 -7.83506 0.32068
magnitude: 1.50409 au
magnitude: 3.82309 debye
