program: Orca
programVersion: 5.0.2
elementType: Si F O O C C C C C C C C C C C C C C C C C C C C C C C C C H H H H H H H H H H H H H H H H H H H H H H H H H H H H H
charge: 0
multiplicity: 1
keywords: wb97x-d3
keywords: def2-TZVPP
keywords: def2/J RIJCOSX
keywords: DEFGRID2
keywords: scfconv7
keywords: smallprint printgap noloewdin
keywords: NOSOSCF
formula: C25H29FO2Si
InChI: InChI=1/C25H29FO2Si/c1-4-27-21-13-15-23(16-14-21)29(2,3)18-8-9-20-12-17-24(26)25(19-20)28-22-10-6-5-7-11-22/h5-7,10-17,19H,4,8-9,18H2,1-3H3
58 atoms
Si -3.540282 1.801258 0.490309
F  1.742955 -4.959602 0.47417
O  1.768355 2.495096 -2.320507
O  2.302823 -2.352093 0.408175
C  -4.183641 0.057114 0.125359
C  -3.150745 -1.056208 0.342547
C  -1.874296 2.081466 -0.336807
C  -3.321992 1.971251 2.352948
C  -4.786328 3.061329 -0.14443
C  -2.337327 -1.366907 -0.917301
C  -1.77891 2.373143 -1.703651
C  -0.674766 1.937899 0.357601
C  -1.232393 -2.34004 -0.626149
C  -0.560137 2.505009 -2.340409
C  0.565904 2.063778 -0.260003
C  0.628045 2.348832 -1.621649
C  0.031467 -1.871655 -0.279404
C  -1.463404 -3.712596 -0.623038
C  1.037893 -2.748764 0.096637
C  -0.460215 -4.601356 -0.266348
C  0.773142 -4.111233 0.104837
C  3.01146 2.356331 -1.64537
C  4.116892 2.58964 -2.644395
C  2.511222 -1.23162 1.165709
C  1.665983 -0.855778 2.202812
C  3.656302 -0.498213 0.886438
C  1.972997 0.271764 2.951217
C  3.955749 0.62067 1.650739
C  3.11336 1.016421 2.680293
H  -5.0448 -0.098278 0.784569
H  -4.586548 0.002907 -0.891719
H  -3.645022 -1.976728 0.667438
H  -2.46171 -0.794319 1.153534
H  -2.903788 2.941887 2.627752
H  -4.282749 1.875501 2.86436
H  -2.664057 1.204054 2.767098
H  -4.935641 2.98029 -1.223298
H  -5.762372 2.916173 0.32475
H  -4.472374 4.085711 0.066247
H  -3.005818 -1.772939 -1.681158
H  -1.918077 -0.444849 -1.324764
H  -2.678214 2.498495 -2.297265
H  -0.682617 1.71426 1.418655
H  -0.514824 2.731253 -3.399141
H  1.461469 1.935682 0.334805
H  0.227488 -0.805037 -0.298737
H  -2.436381 -4.097863 -0.90186
H  -0.63547 -5.669683 -0.263576
H  3.093483 1.354807 -1.211429
H  3.080703 3.079207 -0.825152
H  4.086152 1.861251 -3.455346
H  4.065984 3.590829 -3.073838
H  5.080614 2.490638 -2.144311
H  0.77875 -1.430684 2.435917
H  4.310374 -0.805735 0.079944
H  1.312814 0.562996 3.758152
H  4.849912 1.189715 1.430263
H  3.34516 1.893353 3.270249
elementType: Si F O C H
totalener: -1510.06976751 hartree
nucrepener: 2961.37009728 hartree
electener: -4471.43986478 hartree
oneelecener: -7952.43795983 hartree
twoeener: 3480.99809505 hartree
cpcmener: -0.02163713 hartree
kineticenergy: 1503.91209477 hartree
xcener: -135.232854827183 hartree
chargesum: -0.0000000
charge: 0.483296 -0.217595 -0.325225 -0.328978 -0.274358 -0.136677 -0.143472 -0.430132 -0.451887 -0.064722 -0.107611 -0.190017 -0.012553 -0.270358 -0.206400 0.339851 -0.170055 -0.197076 0.192872 -0.177353 0.189280 0.081338 -0.278721 0.317050 -0.188477 -0.264569 -0.179548 -0.144610 -0.139899 0.093270 0.080615 0.096568 0.076068 0.109399 0.108324 0.097107 0.099682 0.102533 0.104305 0.092433 0.081118 0.131762 0.148962 0.131219 0.105664 0.133503 0.141914 0.146862 0.082869 0.092804 0.088839 0.089763 0.089128 0.152656 0.148364 0.158178 0.157078 0.155620
qa: 0.4833 -0.2176 -0.3252 -0.3290 -0.2744 -0.1367 -0.1435 -0.4301 -0.4519 -0.0647 -0.1076 -0.1900 -0.0126 -0.2704 -0.2064 0.3399 -0.1701 -0.1971 0.1929 -0.1774 0.1893 0.0813 -0.2787 0.3171 -0.1885 -0.2646 -0.1795 -0.1446 -0.1399 0.0933 0.0806 0.0966 0.0761 0.1094 0.1083 0.0971 0.0997 0.1025 0.1043 0.0924 0.0811 0.1318 0.1490 0.1312 0.1057 0.1335 0.1419 0.1469 0.0829 0.0928 0.0888 0.0898 0.0891 0.1527 0.1484 0.1582 0.1571 0.1556
va: 4.1430 1.0682 2.0971 2.0866 3.8340 3.8707 3.7411 3.8975 3.9093 3.7705 3.8594 3.8512 3.6991 4.0371 3.7980 3.7729 3.8943 3.8982 3.6892 3.8902 4.0378 3.7868 3.9788 3.6510 3.8573 3.9292 3.8721 3.8443 3.8335 1.0098 1.0119 1.0066 1.0029 1.0067 1.0102 1.0111 1.0122 1.0098 1.0090 1.0117 1.0191 0.9932 0.9834 1.0151 1.0377 0.9984 1.0014 0.9992 0.9871 0.9864 1.0033 1.0041 1.0055 0.9989 1.0084 0.9917 0.9893 0.9902
dispcorr: -0.034007870 hartree
energy: -1510.103775375582
dipole: -17.00899 16.47368 -0.53531 26.58704 -25.75798 0.82905 -0.29071 0.72929 0.43857
magnitude: 1.07992 au
magnitude: 2.74494 debye
