program: Gaussian 09
title: 000071353
version: EM64L-G09RevD.01
frameworkgroup: C1[X(C21H23NO)]
method: RPBEPBE
basis: SDD
operation: Freq
keyword: #p
keyword: freq=noraman
keyword: PBEPBE/SDD
title: #p freq=noraman PBEPBE/SDD
converged: YES YES NO NO
title: Mulliken charges:
elementType: O N C C C C C C C C C C C C C C C C C C C C C H H H H H H H H H H H H H H H H H H H H H H H
charge: -0.283090 -0.143461 -0.159533 -0.492726 0.433256 -0.300956 -0.633412 -0.640327 -0.450237 -0.378233 0.251573 0.126822 -0.224433 -0.244705 0.435936 -0.242988 -0.386525 -0.374245 -0.458469 -0.240374 -0.423996 -0.238911 -0.240137 0.200026 0.235516 0.242123 0.223937 0.240007 0.189423 0.219379 0.256674 0.243369 0.221647 0.194320 0.234081 0.269361 0.224947 0.225422 0.228642 0.251448 0.266738 0.235218 0.221250 0.235718 0.225414 0.224516
chargesum: 0.00000
title: Mulliken charges with hydrogens summed into heavy atoms:
elementType: O N C C C C C C C C C C C C C C C C C C C C C
charge: -0.283090 -0.143461 0.040493 -0.015088 0.433256 0.162988 0.032063 0.019009 -0.216156 -0.108873 0.251573 0.126822 0.000514 -0.019283 0.435936 -0.014346 -0.135077 -0.107508 -0.223251 -0.019125 -0.188278 -0.013497 -0.015621
polarizability: 2.83520880e+02 -1.45871210e+01 2.04128770e+02 -8.69312879e+00 3.40115771e+01 2.24224850e+02
1716.lowfreq: -4.6985 -2.0370 -0.0007 -0.0006 -0.0004 2.2902 12.6853 21.3389 42.2586
frequency: 12.4083 21.3320 42.2380 49.8823 74.7666 84.5848 92.0033 134.3967 144.9080 152.1612 180.5517 187.9914 223.5581 236.6422 260.6423 264.8046 276.3508 318.1096 329.8619 345.3064 375.6230 408.2547 419.9653 440.8948 461.3597 472.2603 492.5146 512.1621 526.3806 573.3967 575.6932 610.2775 616.9281 642.9333 657.1886 710.8485 721.6091 740.4078 766.6659 779.2299 782.2154 783.8403 797.6933 807.3070 851.7454 855.1543 863.6805 868.5308 892.1619 933.7016 951.0958 958.7266 961.2401 974.3802 986.4327 990.3421 993.7996 1004.0247 1019.6279 1022.1059 1025.0252 1033.6373 1061.3658 1070.8806 1084.5889 1087.1528 1089.9001 1106.9174 1138.0976 1146.9781 1169.7772 1170.0609 1174.3946 1180.1745 1185.5773 1187.5487 1214.1167 1230.9035 1238.3698 1250.0382 1267.5781 1268.7567 1287.9653 1305.1375 1332.4399 1345.1839 1370.6310 1385.1310 1388.9104 1404.0801 1419.3401 1427.3902 1438.2773 1439.0498 1446.7430 1452.8188 1461.6023 1469.4469 1474.4527 1480.1551 1484.3225 1487.2644 1497.9484 1516.5981 1583.6323 1592.6322 1596.3609 1612.9316 1634.9073 2810.2717 2859.4290 2872.9737 2976.2888 3013.5027 3034.2209 3036.5201 3037.5366 3071.3521 3090.8802 3100.3126 3110.4370 3119.8126 3122.2581 3126.0677 3134.0442 3134.8063 3145.0047 3148.0445 3153.5417 3161.8904 3170.4544 3172.8352
redmass: 4.8613 4.8018 3.8675 4.6840 4.5818 4.2243 2.6786 3.9668 4.6672 2.6226 3.2536 3.2477 1.1770 1.3179 3.6334 3.9615 3.1334 3.2762 3.2248 3.4036 2.3504 2.8929 3.1025 3.5406 3.0911 3.3073 5.7565 3.7748 4.9745 3.2640 4.3643 6.2353 6.3724 3.2378 4.5873 1.9118 4.3122 1.3156 2.2861 1.6683 3.3175 2.1697 3.2631 1.9423 1.6750 4.5889 1.2668 1.4786 1.6167 1.4373 2.7455 6.0839 1.3332 1.3808 1.4070 5.2290 1.3267 1.3102 2.1166 2.5349 2.1692 1.5810 3.0302 1.6559 1.9502 1.8912 1.2940 2.7422 1.4410 1.4231 1.0841 1.1181 1.3005 1.2708 1.3241 1.9995 1.5527 1.8177 2.3202 2.1791 1.7626 1.6546 1.3193 1.4216 1.2719 1.4472 1.9537 4.9845 1.7208 3.0014 1.1460 6.0390 1.8979 2.4188 1.2769 2.4465 1.0638 1.0618 1.0922 1.9861 1.0732 1.1110 1.0879 3.7611 6.9079 6.1168 5.7577 6.1531 6.9661 1.0805 1.0569 1.0569 1.0557 1.0603 1.0744 1.0848 1.0931 1.1042 1.1000 1.0994 1.0876 1.0858 1.0858 1.0859 1.0902 1.0908 1.0957 1.0947 1.0962 1.1013 1.0953 1.0970
irintensity: 0.0164 0.0547 0.3307 0.4667 0.2162 0.4145 1.1277 0.7956 3.1447 3.2916 0.6806 0.2183 0.6394 1.1774 0.9236 1.9974 0.5946 0.7274 2.8028 5.3049 1.0801 0.0543 6.4578 1.0528 7.0610 0.0372 2.5063 1.8077 6.9769 10.5994 2.1221 4.5031 0.2970 1.0688 3.5845 36.4440 53.6921 2.1379 31.3465 65.7481 20.9545 22.2563 8.0145 57.8679 4.1019 2.9732 0.2359 1.0869 3.1814 1.2428 27.2478 53.2918 0.0792 5.2505 0.0484 0.3416 0.0156 2.5638 16.6171 26.3939 9.2197 19.1499 97.3160 15.6502 35.9942 42.6430 3.1589 16.1829 10.4232 8.3767 2.0610 0.4564 0.4400 0.7261 17.4537 2.6012 2.0016 53.2364 117.0184 8.8820 43.1746 4.9555 2.7256 16.1678 0.6901 14.9627 34.7480 2.9195 1.3519 35.6479 0.0652 33.7885 7.0749 10.0043 26.9782 45.0894 7.0776 16.0430 6.6265 13.1561 6.6136 23.4439 9.4496 30.3730 90.6714 1.0998 4.0764 5.8670 3.9638 62.3688 59.6497 203.2043 19.5546 21.2175 20.1031 47.7769 9.8883 49.5691 37.3577 29.6334 8.7566 1.1337 0.2747 1.4385 16.5258 10.7084 33.4493 33.1267 38.3125 27.5214 23.9234 9.7487
temp: 298.150 k
press: 1.00000 atm
elementType: 8 7 6 6 6 6 6 6 6 6 6 6 6 6 6 6 6 6 6 6 6 6 6 1 1 1 1 1 1 1 1 1 1 1 1 1 1 1 1 1 1 1 1 1 1 1
symmnumber: 1
zpe: 1008180.3 jmol-1
zpe.correction: 0.383996 hartree
zpe.thermalcorrener: 0.404780 hartree
zpe.thermalcorrenthalpy: 0.405724 hartree
zpe.thermalcorrgfe: 0.332382 hartree
zpe.sumelectzpe: -942.331311 hartree
zpe.sumelectthermal: -942.310527 hartree
zpe.sumelectthermalent: -942.309583 hartree
zpe.sumelectthermalfe: -942.382924 hartree
dipole: 2.3154 0.7021 -0.1829
dipole: 2.4264
quadrupole: -129.7458 -131.0400 -128.8985
quadrupole: 2.1186 1.4453 5.1392
quadrupole: 0.1490 -1.1453 0.9963 2.1186 1.4453 5.1392
hfenergy: -942.7153066 hartree
pointgroup: C01 [X(C21H23N1O1)]
dipole: 0.8788466 0.3174133 -0.195378 debye
polarizability: 284.388341|-9.2954584|219.9167792|-12.2829722|34.7849956|207.5693801 unknown
InChI: InChI=1S/C21H23NO/c1-22(2)20(18-10-4-3-5-11-18)15-16-23-21-14-8-12-17-9-6-7-13-19(17)21/h3-14,20H,15-16H2,1-2H3
charge 0 multiplicity 1
46 atoms
O  -0.989289 0.588705 0.295621
N  2.770899 1.884147 -1.505199
C  2.698969 1.569653 -0.047302
C  1.230761 1.484269 0.468787
C  3.444518 0.269524 0.288455
C  0.372404 0.44479 -0.257146
C  4.171145 2.092739 -1.94961
C  1.935369 3.03885 -1.908165
C  4.088713 0.135338 1.542913
C  3.452133 -0.834009 -0.602356
C  -1.989043 -0.262472 -0.193552
C  -3.292783 -0.071658 0.398839
C  4.721561 -1.074963 1.907152
C  4.088787 -2.042966 -0.244912
C  -4.385061 -0.90834 -0.049818
C  4.723158 -2.170505 1.013355
C  -1.784204 -1.235756 -1.180608
C  -3.529082 0.914359 1.409583
C  -4.150579 -1.898359 -1.063011
C  -2.877259 -2.051647 -1.610054
C  -5.679413 -0.719473 0.539016
C  -4.803293 1.0726 1.962795
C  -5.887591 0.24919 1.524052
H  3.180291 2.394684 0.544784
H  0.739881 2.471114 0.391111
H  1.262847 1.230274 1.543918
H  0.355004 0.624505 -1.349952
H  0.741717 -0.581907 -0.071643
H  4.651164 2.977391 -1.460164
H  4.188877 2.252166 -3.042104
H  4.782085 1.205076 -1.721108
H  0.863393 2.829386 -1.761593
H  2.092234 3.229986 -2.984235
H  2.185943 3.978093 -1.353217
H  4.098944 0.985128 2.238006
H  2.973623 -0.718914 -1.581976
H  5.215748 -1.160982 2.881608
H  4.090294 -2.885399 -0.94626
H  5.215991 -3.108867 1.29149
H  -0.799072 -1.384736 -1.630742
H  -2.69157 1.536491 1.737417
H  -4.982586 -2.528211 -1.39743
H  -2.697607 -2.807402 -2.38281
H  -6.507994 -1.353135 0.200303
H  -4.975737 1.829035 2.736462
H  -6.88229 0.381608 1.964399
