program: Orca
programVersion: 5.0.2
elementType: Si F O O C C C C C C C C C C C C C C C C C C C C C C C C C H H H H H H H H H H H H H H H H H H H H H H H H H H H H H
charge: 0
multiplicity: 1
keywords: wb97x-d3
keywords: def2-TZVPP
keywords: def2/J RIJCOSX
keywords: DEFGRID2
keywords: scfconv7
keywords: smallprint printgap noloewdin
keywords: NOSOSCF
formula: C25H29FO2Si
InChI: InChI=1/C25H29FO2Si/c1-4-27-21-13-15-23(16-14-21)29(2,3)18-8-9-20-12-17-24(26)25(19-20)28-22-10-6-5-7-11-22/h5-7,10-17,19H,4,8-9,18H2,1-3H3
58 atoms
Si -2.202578 1.431233 -0.258955
F  1.502635 -5.246188 -0.98696
O  2.319359 4.341628 2.522784
O  1.023054 -2.87027 -2.148518
C  -2.454634 -0.262572 0.536338
C  -3.435524 -1.15476 -0.232819
C  -0.831097 2.337266 0.661181
C  -3.804117 2.424233 -0.215578
C  -1.66366 1.20971 -2.052844
C  -3.359226 -2.630709 0.144598
C  -0.151483 3.407969 0.066881
C  -0.408304 1.95584 1.93312
C  -2.052338 -3.316201 -0.173748
C  0.890892 4.05675 0.701882
C  0.637321 2.593038 2.594622
C  1.295324 3.652431 1.976152
C  -1.121294 -2.765581 -1.047483
C  -1.757306 -4.548165 0.409653
C  0.083962 -3.402199 -1.306247
C  -0.57462 -5.213998 0.129008
C  0.34228 -4.628854 -0.720527
C  2.788473 3.975938 3.815724
C  3.921548 4.903826 4.179747
C  1.387267 -1.555676 -1.969923
C  1.705827 -0.831628 -3.10992
C  1.478154 -0.973861 -0.710833
C  2.118973 0.487699 -2.986714
C  1.885486 0.34858 -0.604973
C  2.20322 1.086161 -1.7376
H  -1.470115 -0.736858 0.603062
H  -2.796616 -0.153028 1.570114
H  -3.295187 -1.057107 -1.313472
H  -4.455392 -0.8105 -0.046759
H  -3.673326 3.415404 -0.654725
H  -4.595923 1.921987 -0.775574
H  -4.161289 2.562802 0.806673
H  -2.456272 0.761862 -2.655319
H  -1.410053 2.164548 -2.517715
H  -0.786149 0.564593 -2.131064
H  -3.556647 -2.743483 1.21431
H  -4.165489 -3.170325 -0.361795
H  -0.430844 3.746531 -0.924908
H  -0.892648 1.129672 2.441163
H  1.402358 4.880444 0.218313
H  0.922223 2.24937 3.579996
H  -1.311671 -1.816281 -1.53327
H  -2.464204 -4.999065 1.095225
H  -0.354491 -6.172018 0.58246
H  3.131019 2.936262 3.813038
H  1.979285 4.056146 4.548477
H  3.592651 5.942547 4.218486
H  4.302314 4.638664 5.165461
H  4.746926 4.826241 3.471739
H  1.631416 -1.298692 -4.083642
H  1.238401 -1.538539 0.181352
H  2.365242 1.051034 -3.877222
H  1.955898 0.803339 0.374657
H  2.515693 2.11763 -1.644415
elementType: Si F O C H
totalener: -1510.05308619 hartree
nucrepener: 2918.41664721 hartree
electener: -4428.46973339 hartree
oneelecener: -7867.06498780 hartree
twoeener: 3438.59525440 hartree
cpcmener: -0.02732051 hartree
kineticenergy: 1503.89444270 hartree
xcener: -135.233671624945 hartree
chargesum: -0.0000000
charge: 0.458591 -0.220766 -0.339226 -0.347526 -0.275795 -0.110150 -0.080057 -0.437619 -0.403637 -0.101246 -0.162098 -0.179064 0.011900 -0.286917 -0.247119 0.357727 -0.186638 -0.217055 0.182896 -0.175861 0.187542 0.066198 -0.275302 0.269953 -0.211745 -0.180653 -0.137375 -0.143141 -0.204777 0.084547 0.099792 0.078756 0.093754 0.101310 0.102177 0.102543 0.117115 0.119775 0.044696 0.086989 0.096555 0.134521 0.141946 0.134967 0.138226 0.167960 0.143273 0.150367 0.095228 0.094956 0.087197 0.090726 0.087431 0.146572 0.156280 0.159927 0.172295 0.159078
qa: 0.4586 -0.2208 -0.3392 -0.3475 -0.2758 -0.1102 -0.0801 -0.4376 -0.4036 -0.1012 -0.1621 -0.1791 0.0119 -0.2869 -0.2471 0.3577 -0.1866 -0.2171 0.1829 -0.1759 0.1875 0.0662 -0.2753 0.2700 -0.2117 -0.1807 -0.1374 -0.1431 -0.2048 0.0845 0.0998 0.0788 0.0938 0.1013 0.1022 0.1025 0.1171 0.1198 0.0447 0.0870 0.0966 0.1345 0.1419 0.1350 0.1382 0.1680 0.1433 0.1504 0.0952 0.0950 0.0872 0.0907 0.0874 0.1466 0.1563 0.1599 0.1723 0.1591
va: 4.1206 1.0647 2.0648 2.0677 3.8431 3.8880 3.6874 3.9143 3.8869 3.8948 3.8456 3.8879 3.6917 4.0033 3.8684 3.7139 3.8441 3.9345 3.7109 3.8732 4.0648 3.7917 3.9731 3.6837 3.9569 3.8492 3.9049 3.8273 3.8699 1.0077 1.0165 1.0005 1.0042 1.0104 1.0077 1.0095 1.0114 1.0119 1.0357 1.0031 1.0015 0.9946 0.9931 1.0138 1.0129 0.9787 0.9990 0.9970 0.9866 0.9869 1.0033 1.0054 1.0033 1.0059 0.9999 0.9889 0.9749 0.9940
dispcorr: -0.033666358 hartree
energy: -1510.086752543521
dipole: -12.74898 11.72441 -1.02457 28.29186 -27.77603 0.51583 11.93221 -10.50238 1.42983
magnitude: 1.83310 au
magnitude: 4.65936 debye
