program: Orca
programVersion: 5.0.2
elementType: Si F O O C C C C C C C C C C C C C C C C C C C C C C C C C H H H H H H H H H H H H H H H H H H H H H H H H H H H H H
charge: 0
multiplicity: 1
keywords: wb97x-d3
keywords: def2-TZVPP
keywords: def2/J RIJCOSX
keywords: DEFGRID2
keywords: scfconv7
keywords: smallprint printgap noloewdin
keywords: NOSOSCF
formula: C25H29FO2Si
InChI: InChI=1/C25H29FO2Si/c1-4-27-21-13-15-23(16-14-21)29(2,3)18-8-9-20-12-17-24(26)25(19-20)28-22-10-6-5-7-11-22/h5-7,10-17,19H,4,8-9,18H2,1-3H3
58 atoms
Si -3.261006 0.900872 1.368342
F  1.894667 -3.877502 -1.04039
O  1.427544 3.789208 -1.155569
O  1.959995 -1.164727 -1.146737
C  -3.358885 -0.952705 0.994015
C  -3.890734 -1.346428 -0.384709
C  -1.783485 1.745276 0.561084
C  -3.0787 1.101052 3.233193
C  -4.840446 1.7321 0.771608
C  -2.939206 -1.050962 -1.546861
C  -0.479844 1.490213 0.98884
C  -1.932095 2.673679 -0.473992
C  -1.639251 -1.801116 -1.44236
C  0.627185 2.121714 0.433372
C  -0.847698 3.319618 -1.040227
C  0.44445 3.060734 -0.581039
C  -0.424683 -1.129092 -1.340056
C  -1.630748 -3.194609 -1.412389
C  0.763397 -1.829203 -1.207871
C  -0.44851 -3.906454 -1.280806
C  0.738538 -3.213967 -1.177177
C  2.793041 3.511238 -0.862551
C  3.314503 2.329475 -1.647679
C  2.623062 -1.120716 0.054175
C  3.973834 -0.799206 -0.00254
C  1.998049 -1.340466 1.274237
C  4.70206 -0.699309 1.172041
C  2.744678 -1.241987 2.442151
C  4.093854 -0.923437 2.400855
H  -2.383398 -1.417458 1.176561
H  -4.021876 -1.374425 1.757741
H  -4.837814 -0.835892 -0.578807
H  -4.12871 -2.414374 -0.392376
H  -3.914384 0.644924 3.767856
H  -2.164129 0.630621 3.600599
H  -3.040456 2.153961 3.519239
H  -5.71642 1.257607 1.218985
H  -4.869519 2.789088 1.043014
H  -4.958246 1.668837 -0.311956
H  -3.438475 -1.323018 -2.480826
H  -2.738214 0.021161 -1.608433
H  -0.299522 0.774906 1.784791
H  -2.918504 2.908257 -0.857591
H  1.611106 1.875069 0.810428
H  -0.995435 4.041419 -1.834504
H  -0.393274 -0.046081 -1.363867
H  -2.561453 -3.741943 -1.494204
H  -0.446855 -4.988486 -1.260665
H  2.942803 3.374992 0.211438
H  3.331334 4.416003 -1.144279
H  2.76514 1.415318 -1.428743
H  3.253514 2.514056 -2.720536
H  4.361314 2.157661 -1.396021
H  4.44818 -0.629561 -0.960638
H  0.94393 -1.580172 1.332712
H  5.754258 -0.45139 1.12245
H  2.256584 -1.415118 3.392229
H  4.666269 -0.848309 3.31537
elementType: Si F O C H
totalener: -1510.05161636 hartree
nucrepener: 3012.68687767 hartree
electener: -4522.73849404 hartree
oneelecener: -8055.66203137 hartree
twoeener: 3532.92353734 hartree
cpcmener: -0.02540406 hartree
kineticenergy: 1503.91871131 hartree
xcener: -135.236361730655 hartree
chargesum: -0.0000000
charge: 0.487943 -0.219970 -0.351396 -0.335691 -0.261091 -0.165049 -0.166100 -0.451892 -0.451362 -0.083662 -0.164541 -0.086798 -0.041523 -0.250459 -0.291773 0.363559 -0.181995 -0.155115 0.148512 -0.202027 0.290426 0.058913 -0.250008 0.300734 -0.274157 -0.209050 -0.112131 -0.163217 -0.189408 0.078213 0.099700 0.090112 0.095240 0.104042 0.101134 0.102402 0.113264 0.114393 0.102709 0.103927 0.080407 0.138664 0.145553 0.133786 0.133864 0.137810 0.143173 0.149642 0.086160 0.108907 0.056289 0.098425 0.092938 0.156840 0.158209 0.160607 0.161406 0.160516
qa: 0.4879 -0.2200 -0.3514 -0.3357 -0.2611 -0.1650 -0.1661 -0.4519 -0.4514 -0.0837 -0.1645 -0.0868 -0.0415 -0.2505 -0.2918 0.3636 -0.1820 -0.1551 0.1485 -0.2020 0.2904 0.0589 -0.2500 0.3007 -0.2742 -0.2091 -0.1121 -0.1632 -0.1894 0.0782 0.0997 0.0901 0.0952 0.1040 0.1011 0.1024 0.1133 0.1144 0.1027 0.1039 0.0804 0.1387 0.1456 0.1338 0.1339 0.1378 0.1432 0.1496 0.0862 0.1089 0.0563 0.0984 0.0929 0.1568 0.1582 0.1606 0.1614 0.1605
va: 4.1180 1.0665 2.0612 2.0377 3.8364 3.9069 3.6935 3.9002 3.9199 3.7977 3.8248 3.7967 3.6714 3.8413 4.0519 3.7160 3.9014 3.8658 3.7393 3.9395 3.9750 3.8545 3.9218 3.5333 3.9669 3.8459 3.8844 3.9174 3.9059 1.0189 1.0064 1.0011 1.0006 1.0095 1.0102 1.0087 1.0064 1.0085 1.0036 1.0059 1.0161 0.9906 0.9862 1.0065 1.0141 0.9979 1.0011 0.9990 0.9976 0.9918 1.0040 1.0095 1.0096 0.9995 1.0020 0.9883 0.9899 0.9890
dispcorr: -0.035773373 hartree
energy: -1510.087389736308
dipole: -17.88269 17.30414 -0.57855 15.23197 -15.44329 -0.21132 9.25640 -8.62161 0.63479
magnitude: 0.88450 au
magnitude: 2.24822 debye
