program: Orca
programVersion: 5.0.2
elementType: Si F O O C C C C C C C C C C C C C C C C C C C C C C C C C H H H H H H H H H H H H H H H H H H H H H H H H H H H H H
charge: 0
multiplicity: 1
keywords: wb97x-d3
keywords: def2-TZVPP
keywords: def2/J RIJCOSX
keywords: DEFGRID2
keywords: scfconv7
keywords: smallprint printgap noloewdin
keywords: NOSOSCF
formula: C25H29FO2Si
InChI: InChI=1/C25H29FO2Si/c1-4-27-21-13-15-23(16-14-21)29(2,3)18-8-9-20-12-17-24(26)25(19-20)28-22-10-6-5-7-11-22/h5-7,10-17,19H,4,8-9,18H2,1-3H3
58 atoms
Si -3.643628 1.803583 0.275768
F  2.274588 -4.349677 -0.111382
O  2.107157 2.073951 -1.615334
O  2.365291 -1.703806 0.089987
C  -3.881109 0.208504 1.294754
C  -2.733912 -0.799624 1.251708
C  -1.86791 1.949894 -0.33935
C  -4.028453 3.280055 1.379287
C  -4.796864 1.780601 -1.210705
C  -2.545786 -1.463695 -0.11442
C  -1.549306 1.749044 -1.681961
C  -0.797892 2.206253 0.526161
C  -1.270782 -2.257773 -0.175815
C  -0.243041 1.778584 -2.153804
C  0.512665 2.240573 0.081235
C  0.802801 2.018557 -1.266587
C  -0.050466 -1.593101 -0.061842
C  -1.267501 -3.642709 -0.29857
C  1.140886 -2.296561 -0.017913
C  -0.075348 -4.35746 -0.292679
C  1.113124 -3.679488 -0.139092
C  2.511013 1.617172 -2.903695
C  2.435641 0.112561 -3.05478
C  2.579758 -0.697383 0.996624
C  1.851427 -0.556437 2.171623
C  3.624161 0.169921 0.704689
C  2.16988 0.475702 3.04408
C  3.937139 1.188266 1.591739
C  3.207816 1.352974 2.7618
H  -4.053515 0.503849 2.334539
H  -4.810994 -0.273198 0.972056
H  -2.895648 -1.584364 1.997119
H  -1.803968 -0.302392 1.541925
H  -3.339427 3.334238 2.224975
H  -3.954844 4.223273 0.834808
H  -5.038567 3.214405 1.789472
H  -4.618057 0.913923 -1.850526
H  -5.837639 1.72717 -0.883594
H  -4.695498 2.675139 -1.828136
H  -3.399609 -2.110492 -0.328733
H  -2.532079 -0.702356 -0.899451
H  -2.334944 1.550534 -2.402006
H  -0.979344 2.37508 1.5823
H  -0.067111 1.609858 -3.207676
H  1.321907 2.432796 0.776365
H  -0.032664 -0.511641 0.01593
H  -2.203848 -4.177401 -0.395785
H  -0.072686 -5.43551 -0.388927
H  3.544161 1.948559 -3.002584
H  1.940655 2.12228 -3.688189
H  1.422996 -0.274402 -2.938673
H  2.778158 -0.160325 -4.053409
H  3.080996 -0.390778 -2.33559
H  1.045168 -1.234884 2.417819
H  4.192011 0.042095 -0.208222
H  1.597923 0.586197 3.956118
H  4.752391 1.860688 1.358969
H  3.448394 2.153442 3.448441
elementType: Si F O C H
totalener: -1510.04997568 hartree
nucrepener: 3042.46527146 hartree
electener: -4552.51524714 hartree
oneelecener: -8115.56172161 hartree
twoeener: 3563.04647447 hartree
cpcmener: -0.02662604 hartree
kineticenergy: 1503.90916251 hartree
xcener: -135.238369143035 hartree
chargesum: 0.0000000
charge: 0.500224 -0.219874 -0.350114 -0.345457 -0.305396 -0.093102 -0.124065 -0.456818 -0.436462 -0.102751 -0.153409 -0.129000 0.021823 -0.254754 -0.284884 0.332723 -0.191756 -0.178059 0.230826 -0.173552 0.169907 0.042398 -0.276771 0.351453 -0.212713 -0.306848 -0.156447 -0.103453 -0.196999 0.100062 0.087268 0.092338 0.066560 0.102058 0.101733 0.104231 0.103017 0.110445 0.108413 0.094967 0.094409 0.148656 0.135143 0.142208 0.151553 0.084558 0.141699 0.149495 0.111638 0.094959 0.091990 0.106822 0.081753 0.156225 0.163642 0.160647 0.159001 0.157839
qa: 0.5002 -0.2199 -0.3501 -0.3455 -0.3054 -0.0931 -0.1241 -0.4568 -0.4365 -0.1028 -0.1534 -0.1290 0.0218 -0.2548 -0.2849 0.3327 -0.1918 -0.1781 0.2308 -0.1736 0.1699 0.0424 -0.2768 0.3515 -0.2127 -0.3068 -0.1564 -0.1035 -0.1970 0.1001 0.0873 0.0923 0.0666 0.1021 0.1017 0.1042 0.1030 0.1104 0.1084 0.0950 0.0944 0.1487 0.1351 0.1422 0.1516 0.0846 0.1417 0.1495 0.1116 0.0950 0.0920 0.1068 0.0818 0.1562 0.1636 0.1606 0.1590 0.1578
va: 4.0575 1.0660 2.0481 2.0461 3.8824 3.8481 3.6946 3.8986 3.9016 3.7565 3.8389 3.8459 3.6571 3.8953 3.9389 3.7096 3.8797 3.8853 3.5713 3.8811 4.0720 3.8418 3.9175 3.5956 3.8858 3.9245 3.8575 3.8664 3.8849 1.0060 1.0078 1.0068 1.0092 1.0100 1.0107 1.0085 1.0086 1.0093 1.0081 1.0159 1.0171 0.9888 0.9962 1.0020 1.0049 1.0197 1.0037 0.9982 0.9924 0.9965 0.9994 1.0132 1.0117 0.9952 0.9937 0.9902 0.9901 0.9908
dispcorr: -0.037171751 hartree
energy: -1510.087147434569
dipole: -23.79803 22.50824 -1.28979 19.07746 -18.74688 0.33058 -3.10414 2.72437 -0.37977
magnitude: 1.38458 au
magnitude: 3.51932 debye
