program: Orca
programVersion: 5.0.2
elementType: Si F O O C C C C C C C C C C C C C C C C C C C C C C C C C H H H H H H H H H H H H H H H H H H H H H H H H H H H H H
charge: 0
multiplicity: 1
keywords: wb97x-d3
keywords: def2-TZVPP
keywords: def2/J RIJCOSX
keywords: DEFGRID2
keywords: scfconv7
keywords: smallprint printgap noloewdin
keywords: NOSOSCF
formula: C25H29FO2Si
InChI: InChI=1/C25H29FO2Si/c1-4-27-21-13-15-23(16-14-21)29(2,3)18-8-9-20-12-17-24(26)25(19-20)28-22-10-6-5-7-11-22/h5-7,10-17,19H,4,8-9,18H2,1-3H3
58 atoms
Si -3.692192 1.67519 0.389447
F  1.835889 -4.848914 -0.62989
O  2.244011 2.741672 0.960072
O  2.219967 -2.22496 -0.312384
C  -4.067483 -0.0311 1.138182
C  -2.956609 -1.072779 1.018492
C  -1.852621 2.037356 0.573916
C  -4.681406 2.956921 1.35001
C  -4.172146 1.771432 -1.42878
C  -2.637025 -1.462075 -0.424834
C  -1.302886 2.330886 1.82244
C  -0.962695 1.978865 -0.504128
C  -1.45592 -2.384012 -0.510251
C  0.055206 2.561007 2.005384
C  0.39466 2.202733 -0.348413
C  0.91616 2.503005 0.91108
C  -0.170619 -1.858788 -0.401592
C  -1.609283 -3.75941 -0.649263
C  0.940337 -2.684787 -0.44982
C  -0.504185 -4.599115 -0.682792
C  0.757501 -4.053202 -0.590433
C  2.88557 2.973133 2.209962
C  3.12153 1.701546 2.995598
C  2.623141 -1.116126 -1.015628
C  2.148947 -0.818977 -2.287571
C  3.586103 -0.318541 -0.413307
C  2.649714 0.292232 -2.951429
C  4.085369 0.781821 -1.094834
C  3.618354 1.0954 -2.363995
H  -4.293413 0.123746 2.198538
H  -4.993865 -0.414891 0.695813
H  -3.229588 -1.977711 1.570278
H  -2.048103 -0.692766 1.494979
H  -4.553128 3.959966 0.938942
H  -5.748644 2.725492 1.321722
H  -4.38709 2.991002 2.40105
H  -3.997688 2.771478 -1.831288
H  -3.62596 1.065402 -2.05623
H  -5.235294 1.553413 -1.552182
H  -3.513181 -1.932528 -0.877773
H  -2.4262 -0.566068 -1.01416
H  -1.941483 2.385729 2.697736
H  -1.328878 1.753396 -1.499545
H  0.416137 2.785367 3.000109
H  1.059756 2.153225 -1.203011
H  -0.037948 -0.788264 -0.283539
H  -2.600893 -4.185727 -0.733848
H  -0.620442 -5.669664 -0.792181
H  2.331306 3.708937 2.799443
H  3.840153 3.43046 1.950737
H  2.194785 1.20794 3.288539
H  3.721205 0.992827 2.423448
H  3.669258 1.941553 3.90748
H  1.403648 -1.441104 -2.766377
H  3.945863 -0.562225 0.578615
H  2.280107 0.524237 -3.94179
H  4.839313 1.398873 -0.623698
H  4.00498 1.957339 -2.890878
elementType: Si F O C H
totalener: -1510.05148969 hartree
nucrepener: 2966.67050474 hartree
electener: -4476.72199443 hartree
oneelecener: -7964.04607272 hartree
twoeener: 3487.32407829 hartree
cpcmener: -0.02855386 hartree
kineticenergy: 1503.90771318 hartree
xcener: -135.233533057115 hartree
chargesum: -0.0000000
charge: 0.478821 -0.220097 -0.345832 -0.342912 -0.277180 -0.121901 -0.132542 -0.466112 -0.428181 -0.084356 -0.165838 -0.115973 -0.001676 -0.239848 -0.299438 0.340688 -0.178402 -0.189743 0.190154 -0.176639 0.186314 0.036504 -0.267606 0.313028 -0.188954 -0.271967 -0.156028 -0.147048 -0.175626 0.096501 0.084953 0.094391 0.077449 0.101175 0.102651 0.100542 0.110002 0.103412 0.108752 0.095515 0.084190 0.137072 0.143251 0.143966 0.155533 0.133508 0.142438 0.149764 0.094950 0.111138 0.094567 0.085763 0.101558 0.155893 0.158792 0.161114 0.161098 0.158450
qa: 0.4788 -0.2201 -0.3458 -0.3429 -0.2772 -0.1219 -0.1325 -0.4661 -0.4282 -0.0844 -0.1658 -0.1160 -0.0017 -0.2398 -0.2994 0.3407 -0.1784 -0.1897 0.1902 -0.1766 0.1863 0.0365 -0.2676 0.3130 -0.1890 -0.2720 -0.1560 -0.1470 -0.1756 0.0965 0.0850 0.0944 0.0774 0.1012 0.1027 0.1005 0.1100 0.1034 0.1088 0.0955 0.0842 0.1371 0.1433 0.1440 0.1555 0.1335 0.1424 0.1498 0.0950 0.1111 0.0946 0.0858 0.1016 0.1559 0.1588 0.1611 0.1611 0.1584
va: 4.0788 1.0650 2.0493 2.0668 3.8491 3.8651 3.6903 3.9062 3.8866 3.7424 3.9008 3.8180 3.6733 3.9052 3.9606 3.7597 3.8912 3.8967 3.6878 3.8796 4.0440 3.8430 3.9158 3.6484 3.8699 3.9349 3.8642 3.8395 3.8585 1.0086 1.0140 1.0082 1.0096 1.0118 1.0105 1.0126 1.0069 1.0111 1.0106 1.0151 1.0173 0.9943 0.9904 1.0021 1.0029 1.0108 1.0034 0.9980 0.9983 0.9922 1.0014 1.0039 1.0107 0.9978 0.9989 0.9900 0.9882 0.9902
dispcorr: -0.034124396 hartree
energy: -1510.085614087165
dipole: -20.91228 19.91440 -0.99788 24.49252 -23.52984 0.96268 9.62197 -9.06082 0.56115
magnitude: 1.49579 au
magnitude: 3.80200 debye
