program: Orca
programVersion: 5.0.2
elementType: Si F O O C C C C C C C C C C C C C C C C C C C C C C C C C H H H H H H H H H H H H H H H H H H H H H H H H H H H H H
charge: 0
multiplicity: 1
keywords: wb97x-d3
keywords: def2-TZVPP
keywords: def2/J RIJCOSX
keywords: DEFGRID2
keywords: scfconv7
keywords: smallprint printgap noloewdin
keywords: NOSOSCF
formula: C25H29FO2Si
InChI: InChI=1/C25H29FO2Si/c1-4-27-21-13-15-23(16-14-21)29(2,3)18-8-9-20-12-17-24(26)25(19-20)28-22-10-6-5-7-11-22/h5-7,10-17,19H,4,8-9,18H2,1-3H3
58 atoms
Si -2.650556 1.587616 -0.783201
F  1.572045 -4.678916 -0.678169
O  2.272891 2.532833 2.611314
O  1.948675 -2.022973 -0.637097
C  -2.94957 -0.258654 -1.098425
C  -3.542327 -1.086324 0.043568
C  -1.142767 1.930133 0.292691
C  -4.169378 2.313814 0.059433
C  -2.368131 2.393325 -2.462137
C  -2.582226 -1.396128 1.198697
C  0.14501 1.999535 -0.253777
C  -1.247615 2.101475 1.672215
C  -1.44383 -2.27526 0.76645
C  1.263324 2.207996 0.533288
C  -0.139007 2.307868 2.48521
C  1.130376 2.35289 1.915073
C  -0.252214 -1.724158 0.307403
C  -1.584075 -3.661863 0.754737
C  0.760579 -2.531869 -0.186678
C  -0.568119 -4.481507 0.286985
C  0.588927 -3.905926 -0.195778
C  2.202643 2.655791 4.027396
C  3.609681 2.773837 4.558111
C  1.9234 -1.04725 -1.603048
C  0.925335 -0.970005 -2.566846
C  2.978523 -0.145607 -1.601636
C  0.988884 0.031371 -3.52639
C  3.031919 0.844278 -2.571706
C  2.035274 0.943736 -3.533502
H  -3.646918 -0.291198 -1.943737
H  -2.030254 -0.718927 -1.477026
H  -3.913711 -2.038013 -0.350134
H  -4.417614 -0.574947 0.453863
H  -4.341994 1.879458 1.046255
H  -4.079991 3.393948 0.189624
H  -5.067533 2.127846 -0.533564
H  -1.520895 1.946362 -2.987512
H  -3.243452 2.27084 -3.103544
H  -2.171569 3.463359 -2.373621
H  -2.196978 -0.469828 1.629348
H  -3.144638 -1.897872 1.988956
H  0.290758 1.887291 -1.322921
H  -2.220348 2.07242 2.150441
H  2.248261 2.257655 0.085125
H  -0.285241 2.43083 3.549697
H  -0.111008 -0.649265 0.323247
H  -2.49882 -4.112351 1.119669
H  -0.677329 -5.558399 0.283467
H  1.707002 1.780072 4.458274
H  1.614396 3.537651 4.300675
H  4.121424 3.646898 4.152617
H  3.576299 2.881331 5.641912
H  4.200093 1.886201 4.329798
H  0.106296 -1.677935 -2.581295
H  3.748544 -0.217656 -0.843876
H  0.210353 0.092334 -4.27566
H  3.854559 1.547393 -2.566332
H  2.0757 1.722009 -4.283656
elementType: Si F O C H
totalener: -1510.05330641 hartree
nucrepener: 2997.07346624 hartree
electener: -4507.12677265 hartree
oneelecener: -8024.62904183 hartree
twoeener: 3517.50226918 hartree
cpcmener: -0.02650698 hartree
kineticenergy: 1503.91164269 hartree
xcener: -135.236113668389 hartree
chargesum: -0.0000000
charge: 0.447071 -0.220163 -0.338392 -0.345646 -0.252162 -0.148897 -0.171055 -0.445273 -0.440539 -0.109043 -0.081467 -0.124031 -0.009159 -0.288538 -0.264160 0.353043 -0.164004 -0.177105 0.175837 -0.193855 0.214416 0.065292 -0.276480 0.311671 -0.172314 -0.285595 -0.185888 -0.113421 -0.165675 0.102176 0.065893 0.092276 0.084742 0.100765 0.112582 0.110562 0.098791 0.106438 0.106018 0.094160 0.096442 0.127571 0.150561 0.138760 0.139225 0.141336 0.144637 0.150011 0.094261 0.095722 0.087779 0.090872 0.087255 0.158456 0.147414 0.161275 0.161082 0.158472
qa: 0.4471 -0.2202 -0.3384 -0.3456 -0.2522 -0.1489 -0.1711 -0.4453 -0.4405 -0.1090 -0.0815 -0.1240 -0.0092 -0.2885 -0.2642 0.3530 -0.1640 -0.1771 0.1758 -0.1939 0.2144 0.0653 -0.2765 0.3117 -0.1723 -0.2856 -0.1859 -0.1134 -0.1657 0.1022 0.0659 0.0923 0.0847 0.1008 0.1126 0.1106 0.0988 0.1064 0.1060 0.0942 0.0964 0.1276 0.1506 0.1388 0.1392 0.1413 0.1446 0.1500 0.0943 0.0957 0.0878 0.0909 0.0873 0.1585 0.1474 0.1613 0.1611 0.1585
va: 4.1613 1.0654 2.0709 2.0677 3.8187 3.9084 3.6630 3.9229 3.9026 3.8221 3.8031 3.8145 3.6837 4.0010 3.9157 3.7972 3.8291 3.8805 3.6863 3.8960 4.0350 3.7925 3.9734 3.6227 3.8257 3.9454 3.8645 3.8350 3.8516 1.0084 1.0250 1.0003 1.0017 1.0061 1.0086 1.0061 1.0106 1.0106 1.0098 1.0130 1.0110 0.9791 0.9846 1.0157 1.0125 0.9944 0.9996 0.9977 0.9865 0.9864 1.0030 1.0054 1.0032 0.9957 1.0087 0.9913 0.9875 0.9902
dispcorr: -0.035084020 hartree
energy: -1510.088390426392
dipole: -17.96520 16.42158 -1.54361 25.27049 -24.46227 0.80822 7.61943 -6.75029 0.86914
magnitude: 1.94714 au
magnitude: 4.94924 debye
