program: Orca
programVersion: 5.0.2
elementType: Si F O O C C C C C C C C C C C C C C C C C C C C C C C C C H H H H H H H H H H H H H H H H H H H H H H H H H H H H H
charge: 0
multiplicity: 1
keywords: wb97x-d3
keywords: def2-TZVPP
keywords: def2/J RIJCOSX
keywords: DEFGRID2
keywords: scfconv7
keywords: smallprint printgap noloewdin
keywords: NOSOSCF
formula: C25H29FO2Si
InChI: InChI=1/C25H29FO2Si/c1-4-27-21-13-15-23(16-14-21)29(2,3)18-8-9-20-12-17-24(26)25(19-20)28-22-10-6-5-7-11-22/h5-7,10-17,19H,4,8-9,18H2,1-3H3
58 atoms
Si -3.974775 1.661061 0.522775
F  2.008742 -4.197537 -0.802755
O  1.748224 2.636243 -1.19605
O  1.927325 -1.512218 -0.989532
C  -4.556117 0.045861 -0.29905
C  -3.45359 -0.953995 -0.643326
C  -2.188227 1.997274 0.030534
C  -4.080852 1.555873 2.399345
C  -5.074706 3.060514 -0.091144
C  -2.714402 -1.490358 0.582764
C  -1.824326 2.145372 -1.314362
C  -1.159688 2.064092 0.967594
C  -1.467249 -2.240791 0.214745
C  -0.512668 2.3505 -1.699805
C  0.168131 2.273308 0.606704
C  0.498038 2.420721 -0.737419
C  -0.339983 -1.530725 -0.196364
C  -1.401565 -3.629195 0.250773
C  0.822854 -2.1911 -0.544757
C  -0.237859 -4.304392 -0.096898
C  0.866882 -3.57579 -0.480081
C  2.797558 2.836099 -0.253152
C  4.060391 3.142146 -1.017424
C  2.818623 -1.018977 -0.071576
C  2.556206 -0.941207 1.289824
C  4.030044 -0.570274 -0.585161
C  3.521524 -0.404332 2.133949
C  4.982033 -0.041741 0.271505
C  4.733995 0.047593 1.635735
H  -5.303265 -0.424751 0.349905
H  -5.093232 0.311971 -1.215122
H  -2.733991 -0.47998 -1.316118
H  -3.868884 -1.800514 -1.198777
H  -3.45522 0.761677 2.810941
H  -3.779353 2.492189 2.873304
H  -5.107065 1.351607 2.712824
H  -4.835098 4.007661 0.395874
H  -4.970988 3.208595 -1.168214
H  -6.127825 2.847921 0.106317
H  -2.435886 -0.662966 1.241289
H  -3.382499 -2.131489 1.162508
H  -2.580376 2.098891 -2.091274
H  -1.378683 1.948655 2.022875
H  -0.261044 2.463249 -2.747447
H  0.921176 2.314363 1.382127
H  -0.362077 -0.446826 -0.23839
H  -2.268315 -4.1996 0.560122
H  -0.19019 -5.385025 -0.062343
H  2.927638 1.941952 0.363543
H  2.546307 3.665933 0.41533
H  4.882704 3.277671 -0.315449
H  4.330575 2.329926 -1.692686
H  3.96351 4.059382 -1.599024
H  1.620201 -1.287466 1.707173
H  4.224063 -0.638242 -1.648164
H  3.312554 -0.342138 3.193925
H  5.92242 0.306375 -0.134966
H  5.477958 0.464116 2.301116
elementType: Si F O C H
totalener: -1510.05364579 hartree
nucrepener: 2980.14567463 hartree
electener: -4490.19932042 hartree
oneelecener: -7990.70620468 hartree
twoeener: 3500.50688426 hartree
cpcmener: -0.02584566 hartree
kineticenergy: 1503.92241635 hartree
xcener: -135.236258708484 hartree
chargesum: -0.0000000
charge: 0.487553 -0.219252 -0.342680 -0.341659 -0.289276 -0.123600 -0.120125 -0.434483 -0.456450 -0.085467 -0.147184 -0.169087 -0.004966 -0.281870 -0.234250 0.363322 -0.138741 -0.148038 0.133977 -0.201624 0.262713 0.077992 -0.292443 0.315483 -0.205958 -0.244909 -0.160649 -0.134403 -0.178845 0.086118 0.099516 0.081047 0.093209 0.105332 0.108257 0.110331 0.100571 0.101684 0.102587 0.082945 0.095668 0.139971 0.147865 0.135666 0.136393 0.059401 0.144133 0.150040 0.046583 0.123196 0.094746 0.088618 0.101259 0.156512 0.143836 0.160817 0.159301 0.159315
qa: 0.4876 -0.2193 -0.3427 -0.3417 -0.2893 -0.1236 -0.1201 -0.4345 -0.4565 -0.0855 -0.1472 -0.1691 -0.0050 -0.2819 -0.2342 0.3633 -0.1387 -0.1480 0.1340 -0.2016 0.2627 0.0780 -0.2924 0.3155 -0.2060 -0.2449 -0.1606 -0.1344 -0.1788 0.0861 0.0995 0.0810 0.0932 0.1053 0.1083 0.1103 0.1006 0.1017 0.1026 0.0829 0.0957 0.1400 0.1479 0.1357 0.1364 0.0594 0.1441 0.1500 0.0466 0.1232 0.0947 0.0886 0.1013 0.1565 0.1438 0.1608 0.1593 0.1593
va: 4.0755 1.0692 2.0455 2.0561 3.8629 3.8517 3.6977 3.8997 3.9003 3.7457 3.8696 3.8575 3.6597 4.0272 3.8294 3.6739 3.8370 3.8686 3.7527 3.9133 4.0172 3.7500 3.9652 3.5909 3.8265 3.9114 3.8898 3.8439 3.8583 1.0121 1.0075 1.0085 1.0098 1.0090 1.0070 1.0109 1.0113 1.0112 1.0096 1.0214 1.0142 0.9908 0.9897 1.0135 1.0126 1.0537 1.0020 0.9982 0.9926 0.9970 1.0036 1.0023 1.0071 1.0005 1.0129 0.9900 0.9889 0.9902
dispcorr: -0.034888638 hartree
energy: -1510.088534431333
dipole: -18.55922 17.89429 -0.66493 23.23578 -22.83296 0.40282 8.28585 -6.87046 1.41539
magnitude: 1.61485 au
magnitude: 4.10461 debye
