program: Orca
programVersion: 5.0.3
elementType: Cl F F F F F F F O O C C C C C C C C C C C C C C C C C H H H H H H H H H H H H H H
charge: 0
multiplicity: 1
keywords: wb97x-d3
keywords: def2-TZVPP
keywords: def2/J RIJCOSX
keywords: DEFGRID2
keywords: scfconv7
keywords: smallprint printgap noloewdin
keywords: NOSOSCF
formula: C17H14ClF7O2
InChI: InChI=1/C17H14ClF7O2/c1-6-11(19)13(21)7(14(22)12(6)20)5-27-15(26)10-8(16(10,2)3)4-9(18)17(23,24)25/h4,8,10H,5H2,1-3H3
41 atoms
Cl -2.889514 1.64495 1.085636
F  -0.473264 1.89185 -1.938958
F  -0.493972 2.999206 -0.095004
F  -2.159267 3.138255 -1.441254
F  3.269403 -1.636444 -1.266555
F  1.177457 -0.618757 2.815754
F  1.484669 1.981128 2.332636
F  3.572424 0.966013 -1.750698
O  0.477758 -2.875583 1.088312
O  0.297577 -2.358639 -1.07556
C  -2.759627 -2.533949 -0.739226
C  -2.44108 -1.26758 0.010602
C  -1.667596 -2.563376 0.289862
C  -2.489726 -2.661357 -2.21978
C  -4.039993 -3.226256 -0.327361
C  -1.781121 -0.124676 -0.624962
C  -0.219474 -2.595101 -0.017002
C  -1.916702 1.141964 -0.246368
C  1.887007 -2.658769 1.025941
C  -1.255396 2.295722 -0.937879
C  2.189607 -1.207454 0.781201
C  2.813296 -0.763518 -0.374303
C  1.763818 -0.242433 1.680528
C  1.925971 1.107523 1.428377
C  2.97773 0.585901 -0.619862
C  2.538551 1.555794 0.268611
C  2.744263 3.008633 -0.029911
H  -3.131951 -1.004383 0.802162
H  -1.916772 -3.018979 1.241279
H  -3.336222 -2.255278 -2.775554
H  -1.58932 -2.161862 -2.559323
H  -2.392563 -3.713636 -2.489984
H  -3.993258 -4.291188 -0.560391
H  -4.237491 -3.12883 0.740972
H  -4.892656 -2.804549 -0.861464
H  -1.131769 -0.315336 -1.468482
H  2.345078 -3.286669 0.262455
H  2.259438 -2.980179 1.997126
H  2.321845 3.270891 -0.998632
H  2.280451 3.642484 0.71921
H  3.80707 3.248748 -0.059651
totalener: -1965.97523272 hartree
nucrepener: 3030.51780308 hartree
electener: -4996.49303579 hartree
oneelecener: -8741.44803094 hartree
twoeener: 3744.95499514 hartree
kineticenergy: 1959.83689682 hartree
xcener: -152.600988334887 hartree
chargesum: -0.0000000
charge: -0.054880 -0.173144 -0.167771 -0.159631 -0.186420 -0.185661 -0.193535 -0.189434 -0.257836 -0.383714 0.078814 0.043797 -0.077625 -0.245313 -0.235717 -0.212191 0.341826 -0.076610 0.059256 0.524789 -0.242581 0.312599 0.213361 0.239030 0.215207 -0.201198 -0.205938 0.078520 0.090353 0.090461 0.103300 0.089217 0.092885 0.075919 0.094399 0.145991 0.116311 0.122430 0.104196 0.103846 0.112691
qa: -0.0549 -0.1731 -0.1678 -0.1596 -0.1864 -0.1857 -0.1935 -0.1894 -0.2578 -0.3837 0.0788 0.0438 -0.0776 -0.2453 -0.2357 -0.2122 0.3418 -0.0766 0.0593 0.5248 -0.2426 0.3126 0.2134 0.2390 0.2152 -0.2012 -0.2059 0.0785 0.0904 0.0905 0.1033 0.0892 0.0929 0.0759 0.0944 0.1460 0.1163 0.1224 0.1042 0.1038 0.1127
va: 1.2813 1.1283 1.1298 1.1498 1.1191 1.1172 1.1032 1.1173 2.1365 2.1042 3.7869 3.7576 3.8794 3.8980 3.9078 3.8992 4.1834 4.0355 3.8710 4.4413 3.7044 3.8163 3.9580 3.8220 3.9536 3.7550 3.9131 1.0369 1.0307 1.0009 1.0231 1.0028 1.0043 1.0076 1.0044 1.0259 1.0172 0.9926 1.0063 1.0151 1.0001
dispcorr: -0.023937630 hartree
energy: -1965.999170348635
dipole: -15.04899 14.63084 -0.41815 -27.99490 26.98578 -1.00913 -5.84108 6.19609 0.35502
magnitude: 1.14857 au
magnitude: 2.91944 debye
