program: Orca
programVersion: 5.0.3
elementType: Cl F F F F F F F O O C C C C C C C C C C C C C C C C C H H H H H H H H H H H H H H
charge: 0
multiplicity: 1
keywords: wb97x-d3
keywords: def2-TZVPP
keywords: def2/J RIJCOSX
keywords: DEFGRID2
keywords: scfconv7
keywords: smallprint printgap noloewdin
keywords: NOSOSCF
formula: C17H14ClF7O2
InChI: InChI=1/C17H14ClF7O2/c1-6-11(19)13(21)7(14(22)12(6)20)5-27-15(26)10-8(16(10,2)3)4-9(18)17(23,24)25/h4,8,10H,5H2,1-3H3
41 atoms
Cl -5.507437 0.557247 0.034593
F  -4.747178 3.370271 -0.689968
F  -2.945595 3.434659 0.485338
F  -4.854257 3.142447 1.441751
F  3.092485 1.183158 1.465785
F  2.631462 -3.373385 0.41699
F  4.355563 -3.091107 -1.592007
F  4.831408 1.45746 -0.534554
O  0.545076 -1.733684 1.646181
O  0.148299 0.2834 0.774883
C  -1.864767 -1.393913 -0.971148
C  -2.691148 -0.751937 0.109146
C  -1.426226 -1.509576 0.472863
C  -1.097858 -0.542711 -1.952494
C  -2.415982 -2.657438 -1.586632
C  -2.82249 0.705597 0.23524
C  -0.192396 -0.855326 0.959531
C  -3.984657 1.34903 0.217951
C  1.813035 -1.292167 2.117577
C  -4.128918 2.834437 0.364309
C  2.798032 -1.105077 0.998808
C  3.381233 0.121565 0.721894
C  3.155651 -2.171099 0.188183
C  4.054851 -2.02329 -0.851804
C  4.286769 0.261988 -0.312791
C  4.645764 -0.80049 -1.127577
C  5.635059 -0.611904 -2.236397
H  -3.592329 -1.29665 0.366978
H  -1.600195 -2.478438 0.925952
H  -1.749459 -0.271177 -2.784038
H  -0.701166 0.375499 -1.529372
H  -0.258142 -1.106705 -2.362004
H  -3.085563 -2.418919 -2.414247
H  -1.609647 -3.280752 -1.976583
H  -2.978039 -3.253434 -0.867033
H  -1.923654 1.29681 0.346514
H  2.147362 -2.081686 2.789199
H  1.712769 -0.376106 2.698774
H  5.784191 -1.527659 -2.800513
H  5.302054 0.1586 -2.930977
H  6.603153 -0.300247 -1.844534
totalener: -1965.97757792 hartree
nucrepener: 2781.32179042 hartree
electener: -4747.29936834 hartree
oneelecener: -8242.76896903 hartree
twoeener: 3495.46960069 hartree
kineticenergy: 1959.83419125 hartree
xcener: -152.600399626792 hartree
chargesum: -0.0000000
charge: -0.062021 -0.162922 -0.164788 -0.162554 -0.183275 -0.184109 -0.192621 -0.187625 -0.259428 -0.399329 0.071953 0.015299 -0.096372 -0.250633 -0.232621 -0.182245 0.367361 -0.073210 0.060454 0.502665 -0.230313 0.317070 0.201113 0.231205 0.197460 -0.180484 -0.201143 0.084505 0.091860 0.096495 0.102941 0.090290 0.093960 0.093974 0.074277 0.160436 0.123926 0.117292 0.099631 0.106055 0.105471
qa: -0.0620 -0.1629 -0.1648 -0.1626 -0.1833 -0.1841 -0.1926 -0.1876 -0.2594 -0.3993 0.0720 0.0153 -0.0964 -0.2506 -0.2326 -0.1822 0.3674 -0.0732 0.0605 0.5027 -0.2303 0.3171 0.2011 0.2312 0.1975 -0.1805 -0.2011 0.0845 0.0919 0.0965 0.1029 0.0903 0.0940 0.0940 0.0743 0.1604 0.1239 0.1173 0.0996 0.1061 0.1055
va: 1.2757 1.1408 1.1402 1.1425 1.1231 1.1184 1.1083 1.1185 2.1427 2.0861 3.7936 3.7886 3.9208 3.9149 3.9126 3.8524 4.1322 4.0237 3.8727 4.4925 3.6760 3.8216 3.9761 3.8761 3.9668 3.7592 3.9228 1.0338 1.0301 1.0032 1.0173 1.0018 1.0041 1.0040 1.0088 1.0298 0.9910 1.0200 1.0146 1.0000 0.9995
dispcorr: -0.020021960 hartree
energy: -1965.997599881526
dipole: 9.33564 -8.36674 0.96890 -21.60756 20.14520 -1.46236 -12.73193 12.39954 -0.33238
magnitude: 1.78543 au
magnitude: 4.53820 debye
