program: Orca
programVersion: 5.0.3
elementType: Cl F F F F F F F O O C C C C C C C C C C C C C C C C C H H H H H H H H H H H H H H
charge: 0
multiplicity: 1
keywords: wb97x-d3
keywords: def2-TZVPP
keywords: def2/J RIJCOSX
keywords: DEFGRID2
keywords: scfconv7
keywords: smallprint printgap noloewdin
keywords: NOSOSCF
formula: C17H14ClF7O2
InChI: InChI=1/C17H14ClF7O2/c1-6-11(19)13(21)7(14(22)12(6)20)5-27-15(26)10-8(16(10,2)3)4-9(18)17(23,24)25/h4,8,10H,5H2,1-3H3
41 atoms
Cl -5.349403 0.802348 0.202515
F  -4.367711 3.39041 1.408046
F  -4.414275 3.497972 -0.736989
F  -2.526213 3.462833 0.294339
F  3.090648 1.037102 1.626697
F  2.517544 -3.3966 0.177392
F  3.992056 -2.868766 -1.988034
F  4.562545 1.552929 -0.510121
O  0.554385 -1.890274 1.722486
O  0.186647 0.178907 0.974876
C  -1.785499 -1.472881 -0.874155
C  -2.623191 -0.733409 0.135011
C  -1.4339 -1.556076 0.595936
C  -0.906361 -0.717847 -1.840256
C  -2.388799 -2.719104 -1.475028
C  -2.650669 0.732526 0.197914
C  -0.178819 -0.95969 1.103885
C  -3.756734 1.466471 0.22652
C  1.860212 -1.502746 2.140576
C  -3.761884 2.964181 0.298036
C  2.746853 -1.195698 0.967231
C  3.293032 0.058179 0.753134
C  3.011434 -2.170369 0.015865
C  3.776368 -1.898201 -1.099464
C  4.067537 0.324361 -0.363338
C  4.326223 -0.643362 -1.319514
C  5.154926 -0.374128 -2.537559
H  -3.573182 -1.204081 0.360757
H  -1.688157 -2.495036 1.073858
H  -0.100276 -1.362425 -2.195301
H  -1.49337 -0.416221 -2.708768
H  -0.451047 0.175935 -1.423156
H  -1.607374 -3.412905 -1.789355
H  -3.03506 -3.243675 -0.770706
H  -2.987984 -2.469899 -2.352137
H  -1.708013 1.259736 0.225671
H  2.238271 -2.36025 2.695058
H  1.813407 -0.6539 2.82211
H  4.572592 -0.525404 -3.44632
H  5.529699 0.644875 -2.548736
H  6.011736 -1.045835 -2.583878
totalener: -1965.97703594 hartree
nucrepener: 2812.01694965 hartree
electener: -4777.99398559 hartree
oneelecener: -8304.17235342 hartree
twoeener: 3526.17836783 hartree
kineticenergy: 1959.84637880 hartree
xcener: -152.603321259492 hartree
chargesum: -0.0000000
charge: -0.062766 -0.162448 -0.163590 -0.165054 -0.183053 -0.185119 -0.190377 -0.190567 -0.257904 -0.396994 0.062259 0.031033 -0.076183 -0.257711 -0.232655 -0.182297 0.356315 -0.077793 0.060803 0.503695 -0.229705 0.309697 0.200016 0.205138 0.231609 -0.179879 -0.201230 0.082368 0.090892 0.090842 0.100144 0.099428 0.094220 0.075075 0.093829 0.154532 0.124554 0.118060 0.104403 0.101123 0.105292
qa: -0.0628 -0.1624 -0.1636 -0.1651 -0.1831 -0.1851 -0.1904 -0.1906 -0.2579 -0.3970 0.0623 0.0310 -0.0762 -0.2577 -0.2327 -0.1823 0.3563 -0.0778 0.0608 0.5037 -0.2297 0.3097 0.2000 0.2051 0.2316 -0.1799 -0.2012 0.0824 0.0909 0.0908 0.1001 0.0994 0.0942 0.0751 0.0938 0.1545 0.1246 0.1181 0.1044 0.1011 0.1053
va: 1.2748 1.1425 1.1400 1.1396 1.1237 1.1167 1.1130 1.1123 2.1420 2.0856 3.8080 3.7687 3.8913 3.9162 3.9110 3.8578 4.1537 4.0330 3.8664 4.4886 3.6820 3.8471 3.9487 3.9303 3.9040 3.7602 3.9219 1.0368 1.0299 1.0006 1.0035 1.0168 1.0040 1.0087 1.0038 1.0343 0.9914 1.0188 0.9997 1.0148 0.9995
dispcorr: -0.020574975 hartree
energy: -1965.997610911249
dipole: 8.03965 -7.16001 0.87963 -23.15753 21.60385 -1.55368 -12.41678 12.01708 -0.39970
magnitude: 1.82960 au
magnitude: 4.65047 debye
