program: Orca
programVersion: 5.0.3
elementType: Cl F F F F F F F O O C C C C C C C C C C C C C C C C C H H H H H H H H H H H H H H
charge: 0
multiplicity: 1
keywords: wb97x-d3
keywords: def2-TZVPP
keywords: def2/J RIJCOSX
keywords: DEFGRID2
keywords: scfconv7
keywords: smallprint printgap noloewdin
keywords: NOSOSCF
formula: C17H14ClF7O2
InChI: InChI=1/C17H14ClF7O2/c1-6-11(19)13(21)7(14(22)12(6)20)5-27-15(26)10-8(16(10,2)3)4-9(18)17(23,24)25/h4,8,10H,5H2,1-3H3
41 atoms
Cl -3.310734 1.039523 1.352107
F  -0.610572 2.382944 0.907134
F  -2.102019 3.135857 -0.443803
F  -0.502552 1.902792 -1.189426
F  1.975556 -1.344041 -1.589069
F  1.652428 0.031285 2.892506
F  2.791599 2.351109 2.256456
F  3.10704 0.977593 -2.224611
O  -0.201888 -1.95062 0.49249
O  -0.7384 -3.895899 1.449672
C  -2.69183 -2.70285 -1.266316
C  -2.888965 -1.465849 -0.443286
C  -2.398423 -2.746215 0.216076
C  -1.572071 -2.785071 -2.275381
C  -3.938006 -3.43182 -1.711082
C  -2.046684 -0.272562 -0.619841
C  -1.041706 -2.945011 0.783435
C  -2.176151 0.852463 0.070141
C  1.127817 -2.038127 1.00092
C  -1.343376 2.074181 -0.166554
C  1.791127 -0.736967 0.672234
C  2.173428 -0.441909 -0.626418
C  2.006349 0.243293 1.627506
C  2.598138 1.447716 1.297406
C  2.760351 0.764227 -0.955693
C  2.99392 1.739568 0.001907
C  3.627392 3.056318 -0.326197
H  -3.916034 -1.233416 -0.180406
H  -3.138591 -3.268915 0.810865
H  -1.341294 -3.829348 -2.490233
H  -1.879271 -2.318607 -3.21311
H  -0.645949 -2.311348 -1.959938
H  -4.741403 -3.352042 -0.978141
H  -4.307444 -3.020823 -2.65214
H  -3.73432 -4.492294 -1.865714
H  -1.290496 -0.291055 -1.392746
H  1.654049 -2.876288 0.539739
H  1.115452 -2.214497 2.075763
H  4.430137 3.289275 0.371732
H  4.04384 3.061499 -1.329199
H  2.895444 3.862019 -0.26422
totalener: -1965.97393910 hartree
nucrepener: 3007.93747459 hartree
electener: -4973.91141369 hartree
oneelecener: -8695.70011144 hartree
twoeener: 3721.78869775 hartree
kineticenergy: 1959.84330544 hartree
xcener: -152.599797947931 hartree
chargesum: 0.0000000
charge: -0.053841 -0.168150 -0.160014 -0.177352 -0.194159 -0.187198 -0.187449 -0.191514 -0.258486 -0.347835 0.075505 -0.027464 -0.083677 -0.265448 -0.235082 -0.086908 0.336515 -0.100591 0.036265 0.515366 -0.224583 0.229317 0.275644 0.208056 0.240252 -0.164044 -0.201809 0.092003 0.091348 0.098963 0.101947 0.075305 0.075505 0.090045 0.095862 0.129997 0.120320 0.114158 0.104547 0.099494 0.109191
qa: -0.0538 -0.1682 -0.1600 -0.1774 -0.1942 -0.1872 -0.1874 -0.1915 -0.2585 -0.3478 0.0755 -0.0275 -0.0837 -0.2654 -0.2351 -0.0869 0.3365 -0.1006 0.0363 0.5154 -0.2246 0.2293 0.2756 0.2081 0.2403 -0.1640 -0.2018 0.0920 0.0913 0.0990 0.1019 0.0753 0.0755 0.0900 0.0959 0.1300 0.1203 0.1142 0.1045 0.0995 0.1092
va: 1.2847 1.1299 1.1508 1.1213 1.1052 1.1183 1.1171 1.1115 2.0961 2.1570 3.8434 3.7694 3.8960 3.9141 3.9051 3.7909 4.2334 4.0333 3.8603 4.4536 3.7258 3.8663 3.8753 3.9264 3.9130 3.7722 3.9203 1.0246 1.0268 1.0042 1.0003 1.0196 1.0084 1.0035 1.0043 1.0137 1.0014 1.0162 1.0016 1.0133 0.9991
dispcorr: -0.023802380 hartree
energy: -1965.997741478604
dipole: -11.14791 11.09017 -0.05774 -27.92880 27.72476 -0.20404 -14.68065 13.72824 -0.95241
magnitude: 0.97573 au
magnitude: 2.48012 debye
