program: Orca
programVersion: 5.0.3
elementType: Cl F F F F F F F O O C C C C C C C C C C C C C C C C C H H H H H H H H H H H H H H
charge: 0
multiplicity: 1
keywords: wb97x-d3
keywords: def2-TZVPP
keywords: def2/J RIJCOSX
keywords: DEFGRID2
keywords: scfconv7
keywords: smallprint printgap noloewdin
keywords: NOSOSCF
formula: C17H14ClF7O2
InChI: InChI=1/C17H14ClF7O2/c1-6-11(19)13(21)7(14(22)12(6)20)5-27-15(26)10-8(16(10,2)3)4-9(18)17(23,24)25/h4,8,10H,5H2,1-3H3
41 atoms
Cl -4.716994 1.87286 0.473451
F  -3.593275 3.478675 -1.766956
F  -5.054965 2.122221 -2.564081
F  -2.964533 1.819586 -2.986967
F  1.773137 1.011947 0.150092
F  4.312536 -2.93121 0.376529
F  6.240918 -1.61446 1.65711
F  3.692148 2.324411 1.45946
O  0.717836 -1.691175 0.274173
O  -0.564981 -1.455064 -1.541437
C  -2.920877 -2.058479 0.386001
C  -2.763762 -0.565963 0.445522
C  -1.552595 -1.471633 0.645531
C  -3.260517 -2.743776 -0.914811
C  -3.583051 -2.705534 1.57971
C  -2.909638 0.281097 -0.741666
C  -0.455813 -1.531677 -0.345655
C  -3.703888 1.341867 -0.817791
C  1.894871 -1.698372 -0.531387
C  -3.82753 2.195516 -2.043412
C  2.982384 -0.99677 0.222518
C  2.86527 0.351306 0.52561
C  4.140512 -1.635117 0.631854
C  5.142154 -0.951316 1.297785
C  3.862566 1.029366 1.198603
C  5.031094 0.396546 1.597899
C  6.11466 1.122483 2.334594
H  -3.107174 -0.105967 1.364901
H  -1.207861 -1.529734 1.670965
H  -4.34303 -2.741016 -1.049908
H  -2.814641 -2.284423 -1.790857
H  -2.934087 -3.784502 -0.8875
H  -3.274096 -3.747599 1.675866
H  -3.336663 -2.198096 2.512948
H  -4.668291 -2.687091 1.469668
H  -2.329581 0.033454 -1.619962
H  1.711237 -1.201596 -1.484784
H  2.170293 -2.730137 -0.748563
H  7.09963 0.769193 2.037773
H  6.073057 2.192642 2.150753
H  6.020611 0.968073 3.410271
totalener: -1965.97783972 hartree
nucrepener: 2729.92528935 hartree
electener: -4695.90312908 hartree
oneelecener: -8139.84768597 hartree
twoeener: 3443.94455690 hartree
kineticenergy: 1959.84330935 hartree
xcener: -152.602258344861 hartree
chargesum: -0.0000000
charge: -0.061686 -0.161940 -0.163218 -0.165410 -0.184822 -0.189714 -0.188462 -0.188337 -0.268045 -0.401174 0.071163 0.032642 -0.105007 -0.247197 -0.230479 -0.191861 0.384555 -0.074575 0.026141 0.503530 -0.170612 0.221876 0.243013 0.226225 0.234072 -0.179582 -0.203271 0.081461 0.090271 0.093590 0.105600 0.089939 0.091513 0.074905 0.094308 0.159087 0.129466 0.107098 0.104721 0.104301 0.105917
qa: -0.0617 -0.1619 -0.1632 -0.1654 -0.1848 -0.1897 -0.1885 -0.1883 -0.2680 -0.4012 0.0712 0.0326 -0.1050 -0.2472 -0.2305 -0.1919 0.3846 -0.0746 0.0261 0.5035 -0.1706 0.2219 0.2430 0.2262 0.2341 -0.1796 -0.2033 0.0815 0.0903 0.0936 0.1056 0.0899 0.0915 0.0749 0.0943 0.1591 0.1295 0.1071 0.1047 0.1043 0.1059
va: 1.2755 1.1451 1.1389 1.1389 1.1205 1.1125 1.1155 1.1148 2.1340 2.0806 3.7868 3.7755 3.9480 3.9106 3.9117 3.8689 4.1045 4.0359 3.8733 4.4883 3.6875 3.9246 3.8908 3.9316 3.9374 3.7782 3.9221 1.0340 1.0297 1.0022 1.0187 1.0019 1.0043 1.0085 1.0045 1.0296 1.0115 1.0105 1.0047 1.0095 0.9978
dispcorr: -0.018796220 hartree
energy: -1965.996635942965
dipole: -2.36724 3.20859 0.84135 -26.17257 25.18930 -0.98327 10.90847 -9.74981 1.15867
magnitude: 1.73701 au
magnitude: 4.41513 debye
