program: Orca
programVersion: 5.0.3
elementType: Cl F F F F F F F O O C C C C C C C C C C C C C C C C C H H H H H H H H H H H H H H
charge: 0
multiplicity: 1
keywords: wb97x-d3
keywords: def2-TZVPP
keywords: def2/J RIJCOSX
keywords: DEFGRID2
keywords: scfconv7
keywords: smallprint printgap noloewdin
keywords: NOSOSCF
formula: C17H14ClF7O2
InChI: InChI=1/C17H14ClF7O2/c1-6-11(19)13(21)7(14(22)12(6)20)5-27-15(26)10-8(16(10,2)3)4-9(18)17(23,24)25/h4,8,10H,5H2,1-3H3
41 atoms
Cl -1.502506 0.898898 1.759861
F  -2.319215 3.263788 0.107564
F  -2.118394 2.299261 -1.805731
F  -0.395802 2.55631 -0.539101
F  1.229424 -0.777784 2.411854
F  3.124272 -1.30718 -1.85062
F  3.70177 1.281364 -1.924779
F  1.743644 1.848829 2.302854
O  0.413661 -2.797577 0.619428
O  -0.214443 -1.729376 -1.241773
C  -3.089485 -2.635799 -0.520106
C  -2.868249 -1.344684 0.192692
C  -1.854133 -2.474234 0.338212
C  -3.000268 -2.713884 -2.024511
C  -4.143041 -3.554441 0.056515
C  -2.525144 -0.089699 -0.504435
C  -0.496458 -2.285071 -0.214559
C  -1.977625 0.952447 0.106355
C  1.783009 -2.577084 0.306355
C  -1.701225 2.274539 -0.541147
C  2.139264 -1.117726 0.274078
C  1.81686 -0.275909 1.327879
C  2.775005 -0.548123 -0.814007
C  3.072318 0.802243 -0.851547
C  2.088692 1.075981 1.274085
C  2.7247 1.652132 0.184726
C  3.009314 3.122137 0.158963
H  -3.450536 -1.185838 1.095802
H  -1.871813 -2.984547 1.293646
H  -3.96625 -2.453145 -2.460915
H  -2.244002 -2.065664 -2.456892
H  -2.767873 -3.733827 -2.334094
H  -5.126353 -3.315307 -0.351366
H  -3.925083 -4.595388 -0.186439
H  -4.207301 -3.474317 1.142406
H  -2.76585 0.003934 -1.555465
H  2.040523 -3.050902 -0.640854
H  2.330535 -3.089726 1.096732
H  3.475056 3.423161 -0.774563
H  2.090028 3.695166 0.273751
H  3.676148 3.406378 0.972906
totalener: -1965.97345143 hartree
nucrepener: 3050.41201352 hartree
electener: -5016.38546495 hartree
oneelecener: -8781.71226991 hartree
twoeener: 3765.32680496 hartree
kineticenergy: 1959.86255061 hartree
xcener: -152.606164509028 hartree
chargesum: -0.0000000
charge: -0.051516 -0.161660 -0.165898 -0.160074 -0.184900 -0.193458 -0.193866 -0.189895 -0.259107 -0.380117 0.104411 -0.097058 -0.065109 -0.277160 -0.234108 -0.072721 0.337656 -0.077285 0.058164 0.504049 -0.163186 0.160744 0.288175 0.239695 0.201960 -0.176908 -0.199001 0.104194 0.085955 0.094910 0.104559 0.089706 0.091593 0.094432 0.074931 0.127115 0.115925 0.117157 0.098229 0.106373 0.103094
qa: -0.0515 -0.1617 -0.1659 -0.1601 -0.1849 -0.1935 -0.1939 -0.1899 -0.2591 -0.3801 0.1044 -0.0971 -0.0651 -0.2772 -0.2341 -0.0727 0.3377 -0.0773 0.0582 0.5040 -0.1632 0.1607 0.2882 0.2397 0.2020 -0.1769 -0.1990 0.1042 0.0860 0.0949 0.1046 0.0897 0.0916 0.0944 0.0749 0.1271 0.1159 0.1172 0.0982 0.1064 0.1031
va: 1.2952 1.1449 1.1404 1.1318 1.1106 1.1100 1.1090 1.1108 2.1348 2.1034 3.7740 3.8905 3.8558 3.9044 3.9002 3.7981 4.1434 4.0067 3.8838 4.4659 3.6395 3.9480 3.8771 3.9060 3.9132 3.7315 3.9181 1.0144 1.0335 0.9978 1.0203 1.0043 1.0046 1.0045 1.0073 1.0157 1.0175 0.9902 1.0147 1.0054 0.9992
dispcorr: -0.024253431 hartree
energy: -1965.997704856145
dipole: -18.26626 17.69572 -0.57053 -27.94622 26.85504 -1.09118 -5.85183 6.14448 0.29264
magnitude: 1.26563 au
magnitude: 3.21698 debye
