program: Orca
programVersion: 5.0.3
elementType: Cl F F F F F F F O O C C C C C C C C C C C C C C C C C H H H H H H H H H H H H H H
charge: 0
multiplicity: 1
keywords: wb97x-d3
keywords: def2-TZVPP
keywords: def2/J RIJCOSX
keywords: DEFGRID2
keywords: scfconv7
keywords: smallprint printgap noloewdin
keywords: NOSOSCF
formula: C17H14ClF7O2
InChI: InChI=1/C17H14ClF7O2/c1-6-11(19)13(21)7(14(22)12(6)20)5-27-15(26)10-8(16(10,2)3)4-9(18)17(23,24)25/h4,8,10H,5H2,1-3H3
41 atoms
Cl -4.668837 0.845928 1.511015
F  -2.845023 2.536247 -1.466896
F  -3.476642 3.414815 0.393695
F  -4.929121 2.542922 -0.92554
F  2.887383 -2.149575 1.969152
F  3.112092 -0.105682 -2.257309
F  4.556188 1.864038 -1.22996
F  4.299518 -0.137763 3.009051
O  0.916866 -2.523448 -0.091327
O  0.02349 -0.828519 -1.242196
C  -2.597087 -2.408182 -0.311011
C  -2.499768 -1.153851 0.515998
C  -1.289328 -2.052967 0.362778
C  -2.750679 -2.304938 -1.808794
C  -3.35606 -3.567756 0.286564
C  -2.622574 0.168006 -0.111347
C  -0.08233 -1.696408 -0.417402
C  -3.528716 1.07518 0.234648
C  2.166114 -2.341127 -0.745733
C  -3.691174 2.400844 -0.446299
C  2.942553 -1.188792 -0.175752
C  3.271971 -1.155636 1.172485
C  3.382351 -0.133593 -0.956118
C  4.135241 0.896702 -0.416302
C  4.006045 -0.118588 1.708835
C  4.457627 0.936773 0.929605
C  5.264572 2.041091 1.539963
H  -2.953303 -1.222504 1.498172
H  -1.060036 -2.644032 1.241947
H  -3.799144 -2.135986 -2.058418
H  -2.172339 -1.503034 -2.259469
H  -2.444247 -3.238253 -2.283812
H  -3.245743 -3.61627 1.370252
H  -4.421021 -3.483111 0.065137
H  -3.002855 -4.514195 -0.126416
H  -1.950587 0.417368 -0.920564
H  2.030163 -2.218374 -1.819548
H  2.704418 -3.273868 -0.579705
H  6.237381 1.675163 1.869517
H  5.434025 2.850508 0.836385
H  4.760701 2.455448 2.412313
totalener: -1965.97708165 hartree
nucrepener: 2772.94843879 hartree
electener: -4738.92552044 hartree
oneelecener: -8226.11460768 hartree
twoeener: 3487.18908724 hartree
kineticenergy: 1959.83544657 hartree
xcener: -152.600173905082 hartree
chargesum: 0.0000000
charge: -0.062865 -0.165329 -0.162660 -0.163401 -0.183769 -0.185147 -0.190046 -0.189280 -0.256917 -0.392202 0.070256 0.026035 -0.110699 -0.251222 -0.231146 -0.183458 0.369264 -0.073544 0.054779 0.504135 -0.216063 0.204251 0.303958 0.221390 0.207664 -0.179797 -0.201140 0.083393 0.092538 0.099225 0.099298 0.092443 0.075086 0.094799 0.091017 0.156870 0.116539 0.124170 0.104514 0.101500 0.105559
qa: -0.0629 -0.1653 -0.1627 -0.1634 -0.1838 -0.1851 -0.1900 -0.1893 -0.2569 -0.3922 0.0703 0.0260 -0.1107 -0.2512 -0.2311 -0.1835 0.3693 -0.0735 0.0548 0.5041 -0.2161 0.2043 0.3040 0.2214 0.2077 -0.1798 -0.2011 0.0834 0.0925 0.0992 0.0993 0.0924 0.0751 0.0948 0.0910 0.1569 0.1165 0.1242 0.1045 0.1015 0.1056
va: 1.2742 1.1392 1.1428 1.1398 1.1186 1.1196 1.1122 1.1158 2.1385 2.0983 3.8041 3.7597 3.9165 3.9124 3.9119 3.8567 4.1527 4.0228 3.8810 4.4905 3.6709 3.9580 3.8508 3.9140 3.9412 3.7614 3.9232 1.0352 1.0294 1.0026 1.0180 1.0020 1.0090 1.0040 1.0042 1.0315 1.0226 0.9899 0.9986 1.0140 1.0009
dispcorr: -0.019491468 hartree
energy: -1965.996573119342
dipole: -0.71020 1.43772 0.72752 -27.49306 26.01489 -1.47818 -2.77154 3.07358 0.30204
magnitude: 1.67497 au
magnitude: 4.25743 debye
