program: Orca
programVersion: 5.0.3
elementType: Cl F F F F F F F O O C C C C C C C C C C C C C C C C C H H H H H H H H H H H H H H
charge: 0
multiplicity: 1
keywords: wb97x-d3
keywords: def2-TZVPP
keywords: def2/J RIJCOSX
keywords: DEFGRID2
keywords: scfconv7
keywords: smallprint printgap noloewdin
keywords: NOSOSCF
formula: C17H14ClF7O2
InChI: InChI=1/C17H14ClF7O2/c1-6-11(19)13(21)7(14(22)12(6)20)5-27-15(26)10-8(16(10,2)3)4-9(18)17(23,24)25/h4,8,10H,5H2,1-3H3
41 atoms
Cl -1.601689 1.114187 1.319133
F  -0.132285 2.34933 -1.02338
F  -2.049676 3.268564 -0.7384
F  -1.703714 2.018627 -2.455989
F  3.137035 -1.350423 -1.400299
F  0.993567 -0.656369 2.724625
F  1.550386 1.935196 2.575948
F  3.749865 1.226137 -1.51476
O  0.250224 -2.714241 0.886763
O  -0.119023 -1.860656 -1.143188
C  -3.100204 -2.632529 -0.662736
C  -2.9182 -1.269752 -0.090897
C  -1.958158 -2.391451 0.303875
C  -2.859541 -2.894413 -2.128057
C  -4.230255 -3.459352 -0.09477
C  -2.447709 -0.128226 -0.898646
C  -0.543716 -2.289752 -0.098567
C  -1.898917 0.958779 -0.373561
C  1.657116 -2.544563 0.726813
C  -1.448498 2.150293 -1.155865
C  2.038513 -1.092686 0.663879
C  2.744597 -0.55998 -0.400465
C  1.666415 -0.20932 1.663611
C  1.967972 1.136046 1.59132
C  3.064053 0.78229 -0.457796
C  2.687288 1.671154 0.535678
C  3.014438 3.129144 0.458407
H  -3.585556 -0.98634 0.717892
H  -2.10353 -2.78204 1.303805
H  -2.613499 -3.945372 -2.288577
H  -3.772869 -2.683384 -2.687733
H  -2.061462 -2.30176 -2.566324
H  -4.407905 -3.240541 0.958991
H  -5.158033 -3.263938 -0.635598
H  -4.01196 -4.52522 -0.181286
H  -2.5846 -0.162728 -1.972719
H  2.013336 -3.084658 -0.149904
H  2.096757 -3.01975 1.60243
H  3.059881 3.581759 1.446229
H  3.974713 3.298315 -0.024322
H  2.25648 3.66431 -0.115685
elementType: Cl F O C H
totalener: -1965.98952403 hartree
nucrepener: 3054.08267292 hartree
electener: -5020.07219695 hartree
oneelecener: -8789.76617490 hartree
twoeener: 3769.69397795 hartree
cpcmener: -0.02086598 hartree
kineticenergy: 1959.82553027 hartree
xcener: -152.602547208731 hartree
chargesum: 0.0000000
charge: -0.071913 -0.164995 -0.173220 -0.169695 -0.206881 -0.201873 -0.207494 -0.208243 -0.277596 -0.452319 0.111007 -0.082170 -0.082234 -0.286360 -0.255482 -0.081470 0.389113 -0.066750 0.065928 0.506260 -0.142138 0.274060 0.176020 0.210928 0.230354 -0.155340 -0.207809 0.121048 0.097047 0.100687 0.101981 0.094945 0.088647 0.095743 0.099060 0.149389 0.120668 0.136244 0.104865 0.108056 0.111932
qa: -0.0719 -0.1650 -0.1732 -0.1697 -0.2069 -0.2019 -0.2075 -0.2082 -0.2776 -0.4523 0.1110 -0.0822 -0.0822 -0.2864 -0.2555 -0.0815 0.3891 -0.0667 0.0659 0.5063 -0.1421 0.2741 0.1760 0.2109 0.2304 -0.1553 -0.2078 0.1210 0.0970 0.1007 0.1020 0.0949 0.0886 0.0957 0.0991 0.1494 0.1207 0.1362 0.1049 0.1081 0.1119
va: 1.2704 1.1224 1.1285 1.1357 1.0907 1.0891 1.0851 1.0910 2.1261 2.0424 3.7890 3.8670 3.8733 3.8962 3.8987 3.7858 4.0938 3.9479 3.8521 4.4693 3.5968 3.8628 3.9484 3.8794 3.9324 3.6926 3.9092 1.0112 1.0314 1.0005 0.9985 1.0173 1.0044 1.0025 1.0020 1.0054 1.0176 0.9910 1.0066 1.0039 1.0018
dispcorr: -0.024398992 hartree
energy: -1966.013923024741
dipole: -18.87556 17.94313 -0.93243 -27.93006 26.56491 -1.36515 -4.36272 4.90685 0.54413
magnitude: 1.74044 au
magnitude: 4.42385 debye
