program: Orca
programVersion: 5.0.3
elementType: Cl F F F F F F F O O C C C C C C C C C C C C C C C C C H H H H H H H H H H H H H H
charge: 0
multiplicity: 1
keywords: wb97x-d3
keywords: def2-TZVPP
keywords: def2/J RIJCOSX
keywords: DEFGRID2
keywords: scfconv7
keywords: smallprint printgap noloewdin
keywords: NOSOSCF
formula: C17H14ClF7O2
InChI: InChI=1/C17H14ClF7O2/c1-6-11(19)13(21)7(14(22)12(6)20)5-27-15(26)10-8(16(10,2)3)4-9(18)17(23,24)25/h4,8,10H,5H2,1-3H3
41 atoms
Cl -1.535544 0.976478 1.636673
F  -2.236535 3.24795 -0.263343
F  -1.838617 2.127887 -2.058205
F  -0.269259 2.471471 -0.625924
F  1.198943 -0.743796 2.459351
F  3.105138 -1.271827 -1.805145
F  3.727829 1.298896 -1.848576
F  1.755171 1.858107 2.377801
O  0.39472 -2.77181 0.659803
O  -0.195771 -1.791034 -1.255795
C  -3.098399 -2.649324 -0.545868
C  -2.873456 -1.340276 0.12889
C  -1.868355 -2.47691 0.321414
C  -3.004324 -2.774592 -2.045844
C  -4.161113 -3.542648 0.051334
C  -2.488329 -0.125061 -0.613059
C  -0.503947 -2.307426 -0.209634
C  -1.934113 0.93519 -0.04127
C  1.773261 -2.55769 0.364543
C  -1.571913 2.197211 -0.75545
C  2.126743 -1.097581 0.328182
C  1.81029 -0.253055 1.380759
C  2.770799 -0.522829 -0.75253
C  3.092399 0.821164 -0.77519
C  2.108321 1.093836 1.341794
C  2.77099 1.67037 0.269755
C  3.090748 3.132007 0.24701
H  -3.460446 -1.144373 1.021422
H  -1.90792 -2.957906 1.291336
H  -3.971835 -2.531738 -2.489313
H  -2.260342 -2.131636 -2.507153
H  -2.766047 -3.802421 -2.324184
H  -4.225395 -3.435813 1.134941
H  -5.141004 -3.302501 -0.365269
H  -3.953828 -4.591431 -0.168146
H  -2.693591 -0.07973 -1.675424
H  2.045631 -3.050961 -0.568075
H  2.311074 -3.059828 1.167573
H  3.381266 3.49051 1.232718
H  3.905755 3.355452 -0.436904
H  2.223095 3.71192 -0.071262
elementType: Cl F O C H
totalener: -1965.98917072 hartree
nucrepener: 3051.92659233 hartree
electener: -5017.91576305 hartree
oneelecener: -8785.44775273 hartree
twoeener: 3767.53198968 hartree
cpcmener: -0.02077939 hartree
kineticenergy: 1959.82608651 hartree
xcener: -152.602760295734 hartree
chargesum: -0.0000000
charge: -0.071928 -0.173061 -0.169982 -0.164166 -0.201438 -0.207153 -0.208748 -0.206929 -0.277988 -0.453118 0.110214 -0.084310 -0.080030 -0.286634 -0.254912 -0.077733 0.392065 -0.071307 0.065672 0.505565 -0.133816 0.172515 0.266462 0.239938 0.213045 -0.162369 -0.207007 0.119487 0.096625 0.103019 0.094761 0.100529 0.088859 0.096636 0.098351 0.148196 0.121396 0.135808 0.107414 0.104334 0.111741
qa: -0.0719 -0.1731 -0.1700 -0.1642 -0.2014 -0.2072 -0.2087 -0.2069 -0.2780 -0.4531 0.1102 -0.0843 -0.0800 -0.2866 -0.2549 -0.0777 0.3921 -0.0713 0.0657 0.5056 -0.1338 0.1725 0.2665 0.2399 0.2130 -0.1624 -0.2070 0.1195 0.0966 0.1030 0.0948 0.1005 0.0889 0.0966 0.0984 0.1482 0.1214 0.1358 0.1074 0.1043 0.1117
va: 1.2702 1.1278 1.1353 1.1241 1.0896 1.0904 1.0899 1.0875 2.1278 2.0414 3.7940 3.8650 3.8747 3.8950 3.8974 3.7850 4.0905 3.9540 3.8541 4.4702 3.5916 3.9420 3.8816 3.9157 3.8901 3.7035 3.9085 1.0123 1.0313 0.9982 1.0182 1.0005 1.0043 1.0022 1.0023 1.0067 1.0172 0.9909 1.0023 1.0086 1.0022
dispcorr: -0.024306546 hartree
energy: -1966.013477262556
dipole: -18.62381 17.81303 -0.81078 -27.96599 26.52325 -1.44274 -4.96469 5.48080 0.51611
magnitude: 1.73355 au
magnitude: 4.40635 debye
