program: Orca
programVersion: 5.0.3
elementType: Cl F F F F F F F O O C C C C C C C C C C C C C C C C C H H H H H H H H H H H H H H
charge: 0
multiplicity: 1
keywords: wb97x-d3
keywords: def2-TZVPP
keywords: def2/J RIJCOSX
keywords: DEFGRID2
keywords: scfconv7
keywords: smallprint printgap noloewdin
keywords: NOSOSCF
formula: C17H14ClF7O2
InChI: InChI=1/C17H14ClF7O2/c1-6-11(19)13(21)7(14(22)12(6)20)5-27-15(26)10-8(16(10,2)3)4-9(18)17(23,24)25/h4,8,10H,5H2,1-3H3
41 atoms
Cl -1.743493 1.160259 1.361979
F  -0.236017 2.466228 -0.889462
F  -2.232535 3.24991 -0.770939
F  -1.666966 1.996685 -2.42665
F  3.425611 -1.435953 -1.313795
F  0.824355 -0.576723 2.507074
F  1.452832 2.004434 2.349205
F  4.132747 1.114605 -1.403323
O  0.298411 -2.726409 0.848742
O  -0.099521 -1.884489 -1.178705
C  -3.070343 -2.657627 -0.670997
C  -2.885576 -1.300949 -0.083801
C  -1.920418 -2.427864 0.288147
C  -2.839073 -2.909356 -2.139806
C  -4.202144 -3.484684 -0.106375
C  -2.421682 -0.149361 -0.8784
C  -0.510545 -2.316119 -0.129553
C  -1.946647 0.965869 -0.340018
C  1.700594 -2.545841 0.671831
C  -1.521033 2.170669 -1.114969
C  2.085997 -1.094129 0.592735
C  2.929898 -0.609042 -0.390237
C  1.618654 -0.171711 1.51648
C  1.954213 1.164754 1.44014
C  3.293619 0.723936 -0.440571
C  2.811223 1.652176 0.465821
C  3.166647 3.103946 0.394041
H  -3.548294 -1.032057 0.733463
H  -2.055697 -2.828672 1.285567
H  -2.048344 -2.310064 -2.58204
H  -2.585896 -3.957889 -2.305467
H  -3.75826 -2.703737 -2.691788
H  -4.363957 -3.289356 0.954516
H  -5.133785 -3.263102 -0.630474
H  -4.000077 -4.550875 -0.222283
H  -2.502494 -0.198287 -1.95739
H  2.049276 -3.092993 -0.203645
H  2.152825 -3.010042 1.547582
H  4.068585 3.269234 -0.189793
H  2.361379 3.673444 -0.072993
H  3.334872 3.522609 1.384724
elementType: Cl F O C H
totalener: -1965.98898672 hartree
nucrepener: 3037.83176095 hartree
electener: -5003.82074767 hartree
oneelecener: -8757.21080899 hartree
twoeener: 3753.39006133 hartree
cpcmener: -0.02078525 hartree
kineticenergy: 1959.81649111 hartree
xcener: -152.600698075835 hartree
chargesum: 0.0000000
charge: -0.071820 -0.165701 -0.173276 -0.169684 -0.206334 -0.200598 -0.206588 -0.208786 -0.279060 -0.452318 0.109517 -0.086421 -0.071232 -0.285567 -0.254016 -0.078166 0.385995 -0.072312 0.064899 0.505076 -0.123853 0.254090 0.181719 0.205239 0.240325 -0.160537 -0.206749 0.118365 0.097857 0.094389 0.101392 0.101798 0.088770 0.096306 0.098411 0.148108 0.122878 0.134447 0.102917 0.112255 0.108265
qa: -0.0718 -0.1657 -0.1733 -0.1697 -0.2063 -0.2006 -0.2066 -0.2088 -0.2791 -0.4523 0.1095 -0.0864 -0.0712 -0.2856 -0.2540 -0.0782 0.3860 -0.0723 0.0649 0.5051 -0.1239 0.2541 0.1817 0.2052 0.2403 -0.1605 -0.2067 0.1184 0.0979 0.0944 0.1014 0.1018 0.0888 0.0963 0.0984 0.1481 0.1229 0.1344 0.1029 0.1123 0.1083
va: 1.2703 1.1240 1.1274 1.1353 1.0917 1.0907 1.0887 1.0894 2.1262 2.0411 3.8038 3.8642 3.8715 3.8961 3.8969 3.7821 4.0937 3.9525 3.8570 4.4746 3.5833 3.9092 3.9328 3.9013 3.9072 3.7218 3.9090 1.0128 1.0303 1.0184 1.0002 0.9988 1.0045 1.0023 1.0023 1.0071 1.0165 0.9914 1.0101 1.0009 1.0015
dispcorr: -0.023918980 hartree
energy: -1966.012905699312
dipole: -18.13509 17.29727 -0.83782 -28.29840 26.87730 -1.42109 -4.54337 5.11340 0.57003
magnitude: 1.74539 au
magnitude: 4.43643 debye
