program: Orca
programVersion: 5.0.3
elementType: Cl F F F F F F F O O C C C C C C C C C C C C C C C C C H H H H H H H H H H H H H H
charge: 0
multiplicity: 1
keywords: wb97x-d3
keywords: def2-TZVPP
keywords: def2/J RIJCOSX
keywords: DEFGRID2
keywords: scfconv7
keywords: smallprint printgap noloewdin
keywords: NOSOSCF
formula: C17H14ClF7O2
InChI: InChI=1/C17H14ClF7O2/c1-6-11(19)13(21)7(14(22)12(6)20)5-27-15(26)10-8(16(10,2)3)4-9(18)17(23,24)25/h4,8,10H,5H2,1-3H3
41 atoms
Cl -4.925032 1.195149 1.120738
F  -4.141112 1.972804 -2.600196
F  -4.546919 3.305487 -0.959423
F  -6.047177 1.91354 -1.604018
F  3.757105 -2.30036 -0.629271
F  2.690515 2.001999 0.926417
F  4.791565 1.949494 2.541019
F  5.868998 -2.354943 0.995944
O  0.887699 -0.659811 -0.112895
O  -0.491409 -0.163911 -1.793201
C  -2.345162 -2.253671 -0.352481
C  -2.788684 -0.904823 0.145214
C  -1.310309 -1.286625 0.17173
C  -2.427782 -2.609703 -1.815965
C  -2.634705 -3.429414 0.550157
C  -3.301892 0.123198 -0.760317
C  -0.307196 -0.643082 -0.70047
C  -4.207383 1.042969 -0.44492
C  1.984554 -0.094006 -0.838627
C  -4.731788 2.059235 -1.408985
C  3.169786 -0.133803 0.073382
C  4.003924 -1.238603 0.138613
C  3.467161 0.918671 0.921493
C  4.560903 0.886693 1.76655
C  5.094113 -1.268099 0.983632
C  5.406684 -0.208319 1.82136
C  6.592937 -0.275993 2.730438
H  -3.230378 -0.902769 1.134645
H  -0.936888 -1.511655 1.163638
H  -3.42455 -2.993912 -2.039548
H  -2.233583 -1.787071 -2.498032
H  -1.712276 -3.400332 -2.048031
H  -1.915399 -4.231889 0.375834
H  -2.582807 -3.159665 1.605461
H  -3.632179 -3.827329 0.355372
H  -2.931908 0.139698 -1.775523
H  1.76036 0.92989 -1.138274
H  2.171159 -0.666809 -1.747752
H  6.46013 -1.051582 3.485668
H  7.500219 -0.510167 2.174018
H  6.758888 0.66393 3.249504
elementType: Cl F O C H
totalener: -1965.99382280 hartree
nucrepener: 2693.95210691 hartree
electener: -4659.94592971 hartree
oneelecener: -8067.86517887 hartree
twoeener: 3407.91924916 hartree
cpcmener: -0.01988530 hartree
kineticenergy: 1959.80055435 hartree
xcener: -152.596236776035 hartree
chargesum: 0.0000000
charge: -0.073625 -0.170891 -0.174184 -0.174155 -0.203440 -0.203390 -0.206957 -0.206014 -0.269658 -0.465821 0.073443 0.035632 -0.074016 -0.268384 -0.251548 -0.160587 0.410364 -0.085906 0.063565 0.509854 -0.231113 0.273192 0.274513 0.225680 0.202814 -0.133766 -0.205759 0.092738 0.100482 0.102212 0.096150 0.101741 0.096999 0.089429 0.096962 0.145390 0.118345 0.124867 0.114187 0.111005 0.099652
qa: -0.0736 -0.1709 -0.1742 -0.1742 -0.2034 -0.2034 -0.2070 -0.2060 -0.2697 -0.4658 0.0734 0.0356 -0.0740 -0.2684 -0.2515 -0.1606 0.4104 -0.0859 0.0636 0.5099 -0.2311 0.2732 0.2745 0.2257 0.2028 -0.1338 -0.2058 0.0927 0.1005 0.1022 0.0962 0.1017 0.0970 0.0894 0.0970 0.1454 0.1183 0.1249 0.1142 0.1110 0.0997
va: 1.2618 1.1325 1.1251 1.1236 1.0984 1.0985 1.0900 1.0939 2.1404 2.0289 3.7992 3.7627 3.9165 3.9006 3.9076 3.8522 4.0935 4.0128 3.8367 4.4844 3.7553 3.8915 3.9055 3.9008 3.9521 3.7199 3.9133 1.0288 1.0284 0.9999 1.0156 0.9990 1.0020 1.0055 1.0021 1.0301 1.0061 1.0032 0.9965 0.9986 1.0137
dispcorr: -0.018471639 hartree
energy: -1966.012294437033
dipole: 6.32002 -4.74607 1.57395 -28.78845 26.97788 -1.81058 1.57278 -0.57302 0.99976
magnitude: 2.59904 au
magnitude: 6.60624 debye
