program: Orca
programVersion: 5.0.3
elementType: Cl F F F F F F F O O C C C C C C C C C C C C C C C C C H H H H H H H H H H H H H H
charge: 0
multiplicity: 1
keywords: wb97x-d3
keywords: def2-TZVPP
keywords: def2/J RIJCOSX
keywords: DEFGRID2
keywords: scfconv7
keywords: smallprint printgap noloewdin
keywords: NOSOSCF
formula: C17H14ClF7O2
InChI: InChI=1/C17H14ClF7O2/c1-6-11(19)13(21)7(14(22)12(6)20)5-27-15(26)10-8(16(10,2)3)4-9(18)17(23,24)25/h4,8,10H,5H2,1-3H3
41 atoms
Cl -5.196731 0.835382 1.013913
F  -4.174354 2.029373 -2.534565
F  -4.734342 3.210754 -0.822981
F  -6.120506 1.795095 -1.646435
F  3.94178 -2.33924 -0.675258
F  2.612372 1.886926 0.883894
F  4.740344 1.974578 2.475962
F  6.066093 -2.256383 0.924737
O  0.940677 -0.773868 -0.180197
O  -0.4245 -0.25843 -1.868302
C  -2.374507 -2.24192 -0.403239
C  -2.727286 -0.881897 0.139368
C  -1.273206 -1.343027 0.106558
C  -2.547134 -2.542012 -1.871017
C  -2.701878 -3.421522 0.480597
C  -3.244297 0.170449 -0.735936
C  -0.253172 -0.732164 -0.770683
C  -4.292169 0.938766 -0.457287
C  2.047553 -0.220771 -0.900123
C  -4.826315 1.994067 -1.372001
C  3.223571 -0.211147 0.026076
C  4.125102 -1.261141 0.087635
C  3.461828 0.859816 0.871835
C  4.565416 0.900843 1.701638
C  5.226506 -1.218424 0.920477
C  5.484839 -0.135015 1.744903
C  6.677803 -0.107007 2.647935
H  -3.138333 -0.880749 1.141651
H  -0.886608 -1.61076 1.082704
H  -3.584402 -2.823086 -2.061151
H  -2.305595 -1.715962 -2.533854
H  -1.920445 -3.388625 -2.157756
H  -2.599361 -3.18102 1.53897
H  -3.727002 -3.754925 0.311136
H  -2.037953 -4.259883 0.262015
H  -2.75989 0.331291 -1.689422
H  1.817909 0.791558 -1.233913
H  2.256043 -0.817978 -1.788239
H  6.993318 0.911091 2.863273
H  6.453704 -0.593108 3.59905
H  7.524321 -0.627086 2.204383
elementType: Cl F O C H
totalener: -1965.99342386 hartree
nucrepener: 2685.54476827 hartree
electener: -4651.53819213 hartree
oneelecener: -8050.96794797 hartree
twoeener: 3399.42975584 hartree
cpcmener: -0.01951282 hartree
kineticenergy: 1959.78298206 hartree
xcener: -152.592746959399 hartree
chargesum: -0.0000000
charge: -0.074689 -0.171265 -0.173885 -0.174364 -0.202937 -0.203538 -0.206404 -0.206604 -0.270230 -0.466466 0.087019 0.034352 -0.101159 -0.266542 -0.251825 -0.166252 0.420766 -0.082506 0.061650 0.510312 -0.227707 0.273211 0.273204 0.216243 0.212238 -0.132058 -0.210655 0.094385 0.101280 0.102482 0.095783 0.101962 0.089715 0.096442 0.096972 0.150294 0.117804 0.124868 0.105391 0.116400 0.106313
qa: -0.0747 -0.1713 -0.1739 -0.1744 -0.2029 -0.2035 -0.2064 -0.2066 -0.2702 -0.4665 0.0870 0.0344 -0.1012 -0.2665 -0.2518 -0.1663 0.4208 -0.0825 0.0616 0.5103 -0.2277 0.2732 0.2732 0.2162 0.2122 -0.1321 -0.2107 0.0944 0.1013 0.1025 0.0958 0.1020 0.0897 0.0964 0.0970 0.1503 0.1178 0.1249 0.1054 0.1164 0.1063
va: 1.2604 1.1324 1.1247 1.1242 1.0990 1.0977 1.0916 1.0917 2.1412 2.0290 3.7743 3.7618 3.9612 3.9019 3.9104 3.8507 4.0784 4.0065 3.8366 4.4848 3.7462 3.8965 3.8959 3.9274 3.9302 3.7311 3.9143 1.0284 1.0280 1.0002 1.0150 0.9996 1.0054 1.0023 1.0021 1.0297 1.0056 1.0036 1.0067 0.9953 1.0046
dispcorr: -0.018467656 hartree
energy: -1966.011891519598
dipole: 6.81250 -5.15948 1.65301 -27.22536 25.58536 -1.64000 1.28287 -0.27202 1.01085
magnitude: 2.53848 au
magnitude: 6.45229 debye
