program: Orca
programVersion: 5.0.3
elementType: Cl F F F F F F F O O C C C C C C C C C C C C C C C C C H H H H H H H H H H H H H H
charge: 0
multiplicity: 1
keywords: wb97x-d3
keywords: def2-TZVPP
keywords: def2/J RIJCOSX
keywords: DEFGRID2
keywords: scfconv7
keywords: smallprint printgap noloewdin
keywords: NOSOSCF
formula: C17H14ClF7O2
InChI: InChI=1/C17H14ClF7O2/c1-6-11(19)13(21)7(14(22)12(6)20)5-27-15(26)10-8(16(10,2)3)4-9(18)17(23,24)25/h4,8,10H,5H2,1-3H3
41 atoms
Cl -1.545872 1.076402 1.314111
F  -1.969937 3.241925 -0.744494
F  -1.655718 1.97983 -2.459861
F  -0.073988 2.282179 -1.033379
F  3.08772 -1.325989 -1.393579
F  0.992562 -0.629189 2.755885
F  1.5332 1.961786 2.591907
F  3.691474 1.249831 -1.52032
O  0.244231 -2.707266 0.922547
O  -0.119604 -1.873741 -1.116832
C  -3.10168 -2.642528 -0.652858
C  -2.922623 -1.279191 -0.084755
C  -1.96526 -2.400013 0.322437
C  -2.852156 -2.91355 -2.115078
C  -4.237787 -3.464999 -0.091566
C  -2.445228 -0.142649 -0.894926
C  -0.549895 -2.297721 -0.069813
C  -1.864785 0.929998 -0.375106
C  1.651924 -2.52468 0.763818
C  -1.394126 2.109941 -1.1612
C  2.018974 -1.070102 0.687188
C  2.707484 -0.536178 -0.388123
C  1.654675 -0.18428 1.687041
C  1.94866 1.162153 1.606646
C  3.020333 0.807129 -0.453206
C  2.653877 1.697647 0.542384
C  2.975985 3.156156 0.457984
H  -3.593645 -0.992331 0.719642
H  -2.120188 -2.786285 1.322406
H  -2.068939 -2.307003 -2.560868
H  -2.584154 -3.960705 -2.263547
H  -3.770397 -2.728093 -2.675124
H  -5.161966 -3.253637 -0.631907
H  -4.029274 -4.531382 -0.191062
H  -4.412416 -3.254394 0.963925
H  -2.598748 -0.171013 -1.967055
H  2.014112 -3.070949 -0.105998
H  2.093632 -2.98492 1.645339
H  3.932121 3.325249 -0.032285
H  2.212445 3.68713 -0.112057
H  3.027401 3.610821 1.444236
elementType: Cl F O C H
totalener: -1965.97692352 hartree
nucrepener: 3065.37136758 hartree
electener: -5031.34829109 hartree
oneelecener: -8812.55359921 hartree
twoeener: 3781.20530812 hartree
cpcmener: -0.02509379 hartree
kineticenergy: 1959.83675669 hartree
xcener: -152.605964666997 hartree
chargesum: 0.0000000
charge: -0.072513 -0.174571 -0.169842 -0.164467 -0.208584 -0.203345 -0.208968 -0.210144 -0.282504 -0.479016 0.111062 -0.074945 -0.089153 -0.286098 -0.257514 -0.086183 0.409413 -0.062684 0.066958 0.507099 -0.137161 0.272525 0.169194 0.210065 0.230426 -0.149943 -0.207370 0.124023 0.099075 0.092751 0.102901 0.102527 0.096662 0.098861 0.090464 0.153077 0.122615 0.139453 0.108823 0.111525 0.105506
qa: -0.0725 -0.1746 -0.1698 -0.1645 -0.2086 -0.2033 -0.2090 -0.2101 -0.2825 -0.4790 0.1111 -0.0749 -0.0892 -0.2861 -0.2575 -0.0862 0.4094 -0.0627 0.0670 0.5071 -0.1372 0.2725 0.1692 0.2101 0.2304 -0.1499 -0.2074 0.1240 0.0991 0.0928 0.1029 0.1025 0.0967 0.0989 0.0905 0.1531 0.1226 0.1395 0.1088 0.1115 0.1055
va: 1.2713 1.1269 1.1356 1.1216 1.0880 1.0868 1.0825 1.0883 2.1242 2.0119 3.7890 3.8641 3.8816 3.8955 3.8996 3.7851 4.0630 3.9401 3.8425 4.4668 3.5862 3.8632 3.9502 3.8773 3.9295 3.6833 3.9088 1.0107 1.0313 1.0166 0.9999 0.9986 1.0021 1.0019 1.0043 1.0035 1.0173 0.9914 1.0036 1.0020 1.0065
dispcorr: -0.024677167 hartree
energy: -1966.001600682973
dipole: -19.17347 18.15055 -1.02292 -27.80182 26.43218 -1.36964 -4.29171 4.89369 0.60198
magnitude: 1.81237 au
magnitude: 4.60667 debye
