program: Orca
programVersion: 5.0.3
elementType: Cl F F F F F F F O O C C C C C C C C C C C C C C C C C H H H H H H H H H H H H H H
charge: 0
multiplicity: 1
keywords: wb97x-d3
keywords: def2-TZVPP
keywords: def2/J RIJCOSX
keywords: DEFGRID2
keywords: scfconv7
keywords: smallprint printgap noloewdin
keywords: NOSOSCF
formula: C17H14ClF7O2
InChI: InChI=1/C17H14ClF7O2/c1-6-11(19)13(21)7(14(22)12(6)20)5-27-15(26)10-8(16(10,2)3)4-9(18)17(23,24)25/h4,8,10H,5H2,1-3H3
41 atoms
Cl -5.224529 0.958694 0.73768
F  -3.938161 3.591782 1.348619
F  -4.53487 3.495451 -0.710376
F  -2.444472 3.493716 -0.200955
F  3.104925 0.921346 1.777387
F  2.396851 -3.342456 -0.070617
F  3.891864 -2.668466 -2.176027
F  4.602873 1.579126 -0.297118
O  0.508177 -1.968249 1.650331
O  0.090242 0.171143 1.163033
C  -1.792493 -1.553496 -0.831106
C  -2.646075 -0.704441 0.077978
C  -1.521429 -1.542825 0.65531
C  -0.811552 -0.922658 -1.788271
C  -2.432367 -2.805357 -1.3754
C  -2.623363 0.757595 0.017969
C  -0.256406 -0.98514 1.172064
C  -3.668553 1.542462 0.258807
C  1.828519 -1.631417 2.082314
C  -3.638606 3.033657 0.169726
C  2.695835 -1.234383 0.922977
C  3.281738 0.013601 0.816567
C  2.928731 -2.120124 -0.118407
C  3.705133 -1.772485 -1.203261
C  4.067702 0.355823 -0.269564
C  4.299255 -0.523904 -1.312419
C  5.149121 -0.181494 -2.494783
H  -3.617778 -1.129697 0.298873
H  -1.8516 -2.429561 1.184484
H  -0.026831 -1.639575 -2.036355
H  -1.319603 -0.655723 -2.715982
H  -0.323803 -0.026299 -1.412357
H  -1.673726 -3.554908 -1.606133
H  -3.133852 -3.244344 -0.665842
H  -2.976421 -2.586197 -2.295553
H  -1.706486 1.250235 -0.273674
H  2.20829 -2.536375 2.553105
H  1.799444 -0.854292 2.844784
H  4.618563 -0.371631 -3.427147
H  5.445168 0.863561 -2.491246
H  6.05821 -0.783543 -2.5042
elementType: Cl F O C H
totalener: -1965.97876842 hartree
nucrepener: 2814.80487002 hartree
electener: -4780.78363844 hartree
oneelecener: -8310.02219839 hartree
twoeener: 3529.23855994 hartree
cpcmener: -0.02586973 hartree
kineticenergy: 1959.80711678 hartree
xcener: -152.599893619702 hartree
chargesum: -0.0000000
charge: -0.077085 -0.175638 -0.175976 -0.171497 -0.207556 -0.206427 -0.209953 -0.210223 -0.276785 -0.473710 0.086733 0.019968 -0.068129 -0.276220 -0.255047 -0.150530 0.402625 -0.083858 0.059092 0.510585 -0.175213 0.280342 0.203489 0.224628 0.237508 -0.152834 -0.208018 0.095144 0.111081 0.103413 0.110141 0.094019 0.095949 0.091566 0.097637 0.139757 0.142742 0.122275 0.111349 0.099478 0.115179
qa: -0.0771 -0.1756 -0.1760 -0.1715 -0.2076 -0.2064 -0.2100 -0.2102 -0.2768 -0.4737 0.0867 0.0200 -0.0681 -0.2762 -0.2550 -0.1505 0.4026 -0.0839 0.0591 0.5106 -0.1752 0.2803 0.2035 0.2246 0.2375 -0.1528 -0.2080 0.0951 0.1111 0.1034 0.1101 0.0940 0.0959 0.0916 0.0976 0.1398 0.1427 0.1223 0.1113 0.0995 0.1152
va: 1.2583 1.1214 1.1223 1.1323 1.0893 1.0889 1.0892 1.0869 2.1287 2.0264 3.8029 3.7974 3.8484 3.9046 3.9000 3.8564 4.1438 3.9972 3.8425 4.4864 3.6138 3.8725 3.9328 3.9255 3.8964 3.7355 3.9134 1.0289 1.0256 0.9973 1.0007 1.0130 1.0026 1.0052 1.0012 1.0278 0.9926 1.0179 0.9986 1.0134 0.9960
dispcorr: -0.020861385 hartree
energy: -1965.999629809726
dipole: 7.58868 -6.43151 1.15717 -24.44709 22.07930 -2.36779 -12.58838 11.84903 -0.73935
magnitude: 2.73717 au
magnitude: 6.95733 debye
