program: Orca
programVersion: 5.0.2
elementType: O O O O N C C C C C C C C C C C C C C C C C C C H H H H H H H H H H H H H H H H H H H H H H H H H
charge: 0
multiplicity: 1
keywords: wb97x-d3
keywords: def2-TZVPP
keywords: def2/J RIJCOSX
keywords: DEFGRID2
keywords: scfconv7
keywords: smallprint printgap noloewdin
keywords: NOSOSCF
formula: C19H25NO4
InChI: InChI=1/C19H25NO4/c1-11(2)9-14-15(19(14,3)4)18(23)24-10-20-16(21)12-7-5-6-8-13(12)17(20)22/h9,14-15H,5-8,10H2,1-4H3
49 atoms
O  0.391206 0.931962 0.307092
O  1.863901 1.825718 -1.128917
O  -2.731268 1.75281 1.955429
O  -1.580934 0.117049 -2.129484
N  -1.857978 1.196959 -0.110175
C  2.781591 -1.225381 -1.039867
C  3.812184 -0.302275 -0.476147
C  2.390797 -0.205169 0.01828
C  2.327887 -1.036448 -2.467605
C  2.763242 -2.66554 -0.588602
C  4.894452 -0.784726 0.420552
C  1.563352 0.962264 -0.349588
C  5.364345 -0.131204 1.483968
C  -0.606041 1.872381 -0.057393
C  6.484297 -0.687024 2.310956
C  4.835503 1.195407 1.936678
C  -3.848626 0.200757 0.471393
C  -3.51537 -0.275602 -0.727597
C  -5.074899 -0.163782 1.223877
C  -4.324748 -1.234416 -1.520573
C  -5.718462 -1.397956 0.587496
C  -5.737586 -1.309799 -0.939109
C  -2.789998 1.144677 0.9237
C  -2.215329 0.321769 -1.132635
H  4.094908 0.50927 -1.142619
H  2.178567 -0.619436 0.997715
H  2.430195 -0.008763 -2.808527
H  1.28178 -1.323898 -2.588452
H  2.924919 -1.664972 -3.130906
H  1.761522 -3.086031 -0.690536
H  3.067768 -2.780621 0.451525
H  3.436951 -3.269277 -1.200168
H  5.35497 -1.732414 0.155389
H  -0.381963 2.319051 -1.024639
H  -0.667457 2.653229 0.700064
H  6.81811 -1.659444 1.950757
H  6.18318 -0.799952 3.355472
H  7.3455 -0.014376 2.307327
H  4.40262 1.120652 2.937706
H  4.077903 1.602902 1.271538
H  5.644565 1.926574 2.004341
H  -4.835732 -0.341044 2.274851
H  -5.768857 0.683023 1.217562
H  -4.344184 -0.937329 -2.571169
H  -3.843904 -2.217554 -1.500462
H  -5.161145 -2.289606 0.889585
H  -6.732714 -1.523982 0.969277
H  -6.298912 -0.421618 -1.243412
H  -6.264757 -2.167974 -1.358648
totalener: -1094.85447272 hartree
nucrepener: 2076.72812374 hartree
electener: -3171.58259646 hartree
oneelecener: -5615.36403725 hartree
twoeener: 2443.78144079 hartree
kineticenergy: 1090.10067130 hartree
xcener: -105.972111163898 hartree
chargesum: -0.0000000
charge: -0.265752 -0.375766 -0.319133 -0.323901 -0.113598 0.122210 -0.008443 -0.120251 -0.248507 -0.275268 -0.244765 0.338809 -0.005389 0.070064 -0.211875 -0.224988 -0.099781 -0.069964 -0.073399 -0.076175 -0.135955 -0.134297 0.266184 0.257617 0.105647 0.088835 0.096557 0.093321 0.081657 0.091249 0.084946 0.089311 0.092995 0.137372 0.114963 0.077819 0.083797 0.087433 0.087300 0.083384 0.089404 0.094878 0.092550 0.094276 0.092540 0.075758 0.080299 0.075709 0.080326
qa: -0.2658 -0.3758 -0.3191 -0.3239 -0.1136 0.1222 -0.0084 -0.1203 -0.2485 -0.2753 -0.2448 0.3388 -0.0054 0.0701 -0.2119 -0.2250 -0.0998 -0.0700 -0.0734 -0.0762 -0.1360 -0.1343 0.2662 0.2576 0.1056 0.0888 0.0966 0.0933 0.0817 0.0912 0.0849 0.0893 0.0930 0.1374 0.1150 0.0778 0.0838 0.0874 0.0873 0.0834 0.0894 0.0949 0.0925 0.0943 0.0925 0.0758 0.0803 0.0757 0.0803
va: 2.1067 2.1254 2.1955 2.1827 3.0925 3.7662 3.8120 3.8298 3.9026 3.9056 3.9046 4.1930 3.7338 3.8856 3.9423 3.9392 3.6562 3.6125 3.9234 3.9272 3.8989 3.8971 4.2805 4.2712 1.0270 1.0286 1.0197 1.0069 1.0018 1.0061 1.0050 1.0019 1.0097 1.0136 1.0103 1.0097 0.9992 0.9986 1.0005 1.0191 1.0024 1.0190 1.0083 1.0189 1.0084 1.0086 1.0116 1.0089 1.0118
dispcorr: -0.023190352 hartree
energy: -1094.877663076055
dipole: 15.73143 -16.86168 -1.13025 -15.39554 14.26896 -1.12658 3.08563 -2.75042 0.33521
magnitude: 1.63065 au
magnitude: 4.14477 debye
