program: Orca
programVersion: 5.0.2
elementType: O O O O N C C C C C C C C C C C C C C C C C C C H H H H H H H H H H H H H H H H H H H H H H H H H
charge: 0
multiplicity: 1
keywords: wb97x-d3
keywords: def2-TZVPP
keywords: def2/J RIJCOSX
keywords: DEFGRID2
keywords: scfconv7
keywords: smallprint printgap noloewdin
keywords: NOSOSCF
formula: C19H25NO4
InChI: InChI=1/C19H25NO4/c1-11(2)9-14-15(19(14,3)4)18(23)24-10-20-16(21)12-7-5-6-8-13(12)17(20)22/h9,14-15H,5-8,10H2,1-4H3
49 atoms
O  0.356151 0.824194 0.487855
O  1.937188 2.202818 -0.295114
O  -2.765146 1.106916 2.2445
O  -1.577566 0.784605 -2.135083
N  -1.87639 1.204599 0.114266
C  2.952741 -0.635019 -1.320367
C  3.885481 -0.03677 -0.317856
C  2.416251 -0.122246 0.007581
C  2.657294 0.120609 -2.593597
C  2.927546 -2.134436 -1.493322
C  4.87287 -0.869181 0.417131
C  1.590873 1.102345 0.041724
C  5.172767 -0.763106 1.712214
C  -0.631031 1.838671 0.378173
C  6.207272 -1.644221 2.344753
C  4.531243 0.230338 2.632362
C  -3.851641 0.049972 0.357013
C  -3.504921 -0.044955 -0.9264
C  -5.080122 -0.530538 0.954277
C  -4.277486 -0.76591 -1.96845
C  -6.042303 -0.952289 -0.158669
C  -5.317036 -1.667578 -1.299073
C  -2.809865 0.830735 1.078594
C  -2.217359 0.67193 -1.126833
H  4.22141 0.968281 -0.56345
H  2.109445 -0.893719 0.705121
H  3.330499 -0.214114 -3.385011
H  2.787003 1.195183 -2.486067
H  1.634212 -0.061065 -2.92913
H  3.100676 -2.664459 -0.556661
H  3.694792 -2.453999 -2.20187
H  1.962051 -2.457002 -1.886423
H  5.412675 -1.603616 -0.174545
H  -0.388466 2.528492 -0.42892
H  -0.710262 2.390233 1.314752
H  6.629098 -2.356159 1.636413
H  5.784694 -2.209235 3.179303
H  7.028787 -1.051992 2.755357
H  5.290913 0.856971 3.106135
H  3.99891 -0.274518 3.442667
H  3.829987 0.889245 2.125894
H  -4.807836 -1.387259 1.579194
H  -5.550278 0.188026 1.62932
H  -4.762043 -0.039517 -2.629054
H  -3.604982 -1.342709 -2.607295
H  -6.823289 -1.594315 0.251381
H  -6.545842 -0.06505 -0.553486
H  -6.036823 -2.015158 -2.041511
H  -4.820018 -2.55982 -0.907436
totalener: -1094.85460659 hartree
nucrepener: 2073.46261264 hartree
electener: -3168.31721923 hartree
oneelecener: -5608.78563873 hartree
twoeener: 2440.46841950 hartree
kineticenergy: 1090.09724260 hartree
xcener: -105.971141059722 hartree
chargesum: 0.0000000
charge: -0.262786 -0.376846 -0.318220 -0.324993 -0.117452 0.119578 0.000880 -0.124807 -0.254891 -0.274003 -0.243978 0.334028 -0.009484 0.076999 -0.211319 -0.223705 -0.103126 -0.066625 -0.074356 -0.075364 -0.135255 -0.135839 0.269434 0.256048 0.105212 0.089961 0.081983 0.095888 0.097166 0.084836 0.089114 0.092424 0.092235 0.130581 0.117838 0.078055 0.083734 0.087427 0.090192 0.086658 0.085545 0.093742 0.094365 0.093274 0.093712 0.080494 0.075791 0.079747 0.076107
qa: -0.2628 -0.3768 -0.3182 -0.3250 -0.1175 0.1196 0.0009 -0.1248 -0.2549 -0.2740 -0.2440 0.3340 -0.0095 0.0770 -0.2113 -0.2237 -0.1031 -0.0666 -0.0744 -0.0754 -0.1353 -0.1358 0.2694 0.2560 0.1052 0.0900 0.0820 0.0959 0.0972 0.0848 0.0891 0.0924 0.0922 0.1306 0.1178 0.0781 0.0837 0.0874 0.0902 0.0867 0.0855 0.0937 0.0944 0.0933 0.0937 0.0805 0.0758 0.0797 0.0761
va: 2.1055 2.1230 2.1961 2.1814 3.0998 3.7651 3.8013 3.8464 3.9035 3.9056 3.9010 4.1963 3.7406 3.8952 3.9420 3.9372 3.6553 3.6165 3.9255 3.9238 3.8967 3.8990 4.2764 4.2708 1.0261 1.0280 1.0019 1.0196 1.0053 1.0054 1.0021 1.0060 1.0100 1.0111 1.0075 1.0098 0.9994 0.9986 1.0023 1.0010 1.0172 1.0087 1.0189 1.0079 1.0194 1.0119 1.0085 1.0117 1.0089
dispcorr: -0.023062259 hartree
energy: -1094.877668847019
dipole: 15.71244 -16.85101 -1.13857 -16.22968 14.97668 -1.25300 -0.76845 0.66506 -0.10339
magnitude: 1.69618 au
magnitude: 4.31136 debye
