program: Orca
programVersion: 5.0.2
elementType: O O O O N C C C C C C C C C C C C C C C C C C C H H H H H H H H H H H H H H H H H H H H H H H H H
charge: 0
multiplicity: 1
keywords: wb97x-d3
keywords: def2-TZVPP
keywords: def2/J RIJCOSX
keywords: DEFGRID2
keywords: scfconv7
keywords: smallprint printgap noloewdin
keywords: NOSOSCF
formula: C19H25NO4
InChI: InChI=1/C19H25NO4/c1-11(2)9-14-15(19(14,3)4)18(23)24-10-20-16(21)12-7-5-6-8-13(12)17(20)22/h9,14-15H,5-8,10H2,1-4H3
49 atoms
O  0.127504 0.945715 -0.101274
O  1.601912 2.267157 0.932293
O  -2.294655 0.110909 2.119382
O  -2.589173 1.668685 -2.146204
N  -2.148899 1.147253 0.060648
C  3.719853 0.486388 -0.545259
C  3.524827 -0.042559 0.840741
C  2.3179 0.194269 -0.035099
C  4.203702 1.904514 -0.719432
C  4.221524 -0.449746 -1.618116
C  3.86385 -1.434584 1.236145
C  1.358082 1.257176 0.325838
C  5.093999 -1.883077 1.487465
C  -0.922643 1.840004 0.242625
C  5.336677 -3.301225 1.906904
C  6.318858 -1.026735 1.384603
C  -3.862453 -0.36433 0.337872
C  -3.947869 0.09134 -0.911626
C  -4.788544 -1.346912 0.954023
C  -4.97121 -0.325015 -1.902511
C  -6.031094 -1.501735 0.07487
C  -5.672845 -1.592018 -1.408825
C  -2.697051 0.277695 1.002455
C  -2.845113 1.063122 -1.143752
H  3.64539 0.704665 1.621923
H  1.858792 -0.691958 -0.459999
H  3.88294 2.312095 -1.679877
H  5.29566 1.919333 -0.707157
H  3.852407 2.572692 0.062021
H  5.313259 -0.470719 -1.626501
H  3.888798 -0.116199 -2.602333
H  3.878606 -1.473037 -1.473507
H  3.031804 -2.123866 1.346895
H  -0.904397 2.715307 -0.407073
H  -0.837064 2.159754 1.280463
H  5.823322 -3.344523 2.884281
H  6.002528 -3.809121 1.204779
H  4.412331 -3.87416 1.967894
H  6.830417 -0.968486 2.34863
H  6.099073 -0.010863 1.061835
H  7.035435 -1.456756 0.680427
H  -4.271858 -2.305116 1.070252
H  -5.057087 -1.033171 1.965187
H  -5.691877 0.487197 -2.043192
H  -4.510219 -0.48319 -2.880008
H  -6.591216 -2.38662 0.380254
H  -6.692691 -0.64552 0.234415
H  -6.570231 -1.772843 -2.002009
H  -5.015762 -2.451453 -1.569896
totalener: -1094.85554123 hartree
nucrepener: 2036.67792418 hartree
electener: -3131.53346541 hartree
oneelecener: -5535.15431400 hartree
twoeener: 2403.62084858 hartree
kineticenergy: 1090.10125559 hartree
xcener: -105.971325374995 hartree
chargesum: -0.0000000
charge: -0.265139 -0.390877 -0.315466 -0.316911 -0.128176 0.070316 -0.033409 -0.086238 -0.263776 -0.244486 -0.182649 0.348000 -0.025567 0.092631 -0.209406 -0.242207 -0.084736 -0.091932 -0.074407 -0.075622 -0.135284 -0.135318 0.260046 0.263807 0.109500 0.077537 0.087847 0.079118 0.106678 0.083449 0.098348 0.083175 0.090326 0.123052 0.123605 0.086355 0.083835 0.079405 0.098153 0.083207 0.087392 0.093061 0.093991 0.092262 0.095077 0.080231 0.075394 0.079776 0.076033
qa: -0.2651 -0.3909 -0.3155 -0.3169 -0.1282 0.0703 -0.0334 -0.0862 -0.2638 -0.2445 -0.1826 0.3480 -0.0256 0.0926 -0.2094 -0.2422 -0.0847 -0.0919 -0.0744 -0.0756 -0.1353 -0.1353 0.2600 0.2638 0.1095 0.0775 0.0878 0.0791 0.1067 0.0834 0.0983 0.0832 0.0903 0.1231 0.1236 0.0864 0.0838 0.0794 0.0982 0.0832 0.0874 0.0931 0.0940 0.0923 0.0951 0.0802 0.0754 0.0798 0.0760
va: 2.1162 2.1084 2.1981 2.1971 3.1191 3.7305 3.8252 3.8794 3.9053 3.9053 3.8564 4.2098 3.7371 3.8968 3.9369 3.9345 3.6158 3.6340 3.9278 3.9253 3.8968 3.8988 4.2795 4.2777 1.0245 1.0341 1.0032 1.0024 1.0222 1.0024 1.0060 1.0072 1.0124 1.0027 1.0068 0.9984 0.9988 1.0107 1.0035 1.0111 0.9989 1.0085 1.0189 1.0079 1.0190 1.0116 1.0087 1.0117 1.0089
dispcorr: -0.022542834 hartree
energy: -1094.878084065310
dipole: 23.47496 -24.21817 -0.74320 -15.82356 14.52071 -1.30285 -1.67730 1.22330 -0.45401
magnitude: 1.56713 au
magnitude: 3.98333 debye
