program: Orca
programVersion: 5.0.2
elementType: O O O O N C C C C C C C C C C C C C C C C C C C H H H H H H H H H H H H H H H H H H H H H H H H H
charge: 0
multiplicity: 1
keywords: wb97x-d3
keywords: def2-TZVPP
keywords: def2/J RIJCOSX
keywords: DEFGRID2
keywords: scfconv7
keywords: smallprint printgap noloewdin
keywords: NOSOSCF
formula: C19H25NO4
InChI: InChI=1/C19H25NO4/c1-11(2)9-14-15(19(14,3)4)18(23)24-10-20-16(21)12-7-5-6-8-13(12)17(20)22/h9,14-15H,5-8,10H2,1-4H3
49 atoms
O  0.139926 0.655277 -0.010256
O  1.694155 2.165812 0.519423
O  -2.504405 0.321767 2.14861
O  -2.398278 1.310956 -2.292397
N  -2.123906 1.031626 -0.015514
C  3.599125 0.0685 -0.831542
C  3.701573 -0.030157 0.659062
C  2.341769 -0.082645 0.010896
C  3.923618 1.37965 -1.504032
C  3.971906 -1.135532 -1.661688
C  4.229669 -1.237766 1.345106
C  1.402872 1.040715 0.207141
C  5.523843 -1.501465 1.52808
C  -0.859646 1.652285 0.160751
C  5.976438 -2.733947 2.250144
C  6.618925 -0.602102 1.041821
C  -4.034766 -0.19827 0.347205
C  -4.005633 0.096413 -0.952162
C  -5.116968 -0.953471 1.026451
C  -5.041087 -0.295368 -1.940318
C  -6.341403 -1.021933 0.11172
C  -5.956096 -1.358724 -1.329121
C  -2.825872 0.376903 0.995138
C  -2.773582 0.879474 -1.238701
H  3.906702 0.915173 1.155492
H  1.868144 -1.056888 -0.048322
H  3.351456 1.499108 -2.426038
H  4.981908 1.39816 -1.772799
H  3.725775 2.241788 -0.87241
H  3.704952 -2.074639 -1.178988
H  5.0491 -1.157014 -1.83882
H  3.47503 -1.10076 -2.632681
H  3.498581 -1.940505 1.734259
H  -0.741952 2.444852 -0.578556
H  -0.806225 2.08349 1.16038
H  6.619007 -3.347436 1.613687
H  5.138508 -3.349881 2.574078
H  6.566498 -2.479473 3.134057
H  6.244803 0.266585 0.503415
H  7.297724 -1.141714 0.376686
H  7.225293 -0.243037 1.877149
H  -4.758395 -1.958565 1.271271
H  -5.362786 -0.486986 1.982872
H  -5.615169 0.590444 -2.231256
H  -4.572585 -0.656661 -2.858486
H  -7.047703 -1.760607 0.493421
H  -6.858759 -0.058303 0.132146
H  -6.852248 -1.469925 -1.941254
H  -5.44546 -2.325836 -1.34876
totalener: -1094.85626105 hartree
nucrepener: 2028.81606975 hartree
electener: -3123.67233081 hartree
oneelecener: -5519.42646571 hartree
twoeener: 2395.75413490 hartree
kineticenergy: 1090.10234818 hartree
xcener: -105.971648588666 hartree
chargesum: -0.0000000
charge: -0.262600 -0.389760 -0.315486 -0.317053 -0.124064 0.075727 -0.029273 -0.084043 -0.270547 -0.244461 -0.184440 0.339899 -0.027814 0.091860 -0.210498 -0.239007 -0.087897 -0.093323 -0.077799 -0.072248 -0.134295 -0.136520 0.263874 0.262242 0.108949 0.076945 0.092459 0.081349 0.105545 0.082061 0.085211 0.096963 0.090798 0.123510 0.122633 0.082830 0.079441 0.086642 0.082804 0.085651 0.097393 0.093158 0.094677 0.092306 0.095181 0.079915 0.075293 0.080055 0.075758
qa: -0.2626 -0.3898 -0.3155 -0.3171 -0.1241 0.0757 -0.0293 -0.0840 -0.2705 -0.2445 -0.1844 0.3399 -0.0278 0.0919 -0.2105 -0.2390 -0.0879 -0.0933 -0.0778 -0.0722 -0.1343 -0.1365 0.2639 0.2622 0.1089 0.0769 0.0925 0.0813 0.1055 0.0821 0.0852 0.0970 0.0908 0.1235 0.1226 0.0828 0.0794 0.0866 0.0828 0.0857 0.0974 0.0932 0.0947 0.0923 0.0952 0.0799 0.0753 0.0801 0.0758
va: 2.1185 2.1107 2.1995 2.1980 3.1153 3.7254 3.8175 3.8881 3.9060 3.9072 3.8551 4.2244 3.7385 3.8982 3.9398 3.9365 3.6167 3.6290 3.9267 3.9261 3.8971 3.8994 4.2759 4.2767 1.0255 1.0342 1.0028 1.0017 1.0202 1.0071 1.0028 1.0055 1.0127 1.0032 1.0034 0.9988 1.0106 0.9982 1.0108 0.9997 1.0027 1.0081 1.0191 1.0083 1.0189 1.0119 1.0089 1.0117 1.0086
dispcorr: -0.022457071 hartree
energy: -1094.878718124797
dipole: 23.15606 -24.01097 -0.85491 -14.33424 13.15131 -1.18293 -2.07685 1.71828 -0.35857
magnitude: 1.50292 au
magnitude: 3.82012 debye
