program: Orca
programVersion: 5.0.2
elementType: O O O O N C C C C C C C C C C C C C C C C C C C H H H H H H H H H H H H H H H H H H H H H H H H H
charge: 0
multiplicity: 1
keywords: wb97x-d3
keywords: def2-TZVPP
keywords: def2/J RIJCOSX
keywords: DEFGRID2
keywords: scfconv7
keywords: smallprint printgap noloewdin
keywords: NOSOSCF
formula: C19H25NO4
InChI: InChI=1/C19H25NO4/c1-11(2)9-14-15(19(14,3)4)18(23)24-10-20-16(21)12-7-5-6-8-13(12)17(20)22/h9,14-15H,5-8,10H2,1-4H3
49 atoms
O  0.359866 0.685622 0.558473
O  1.878886 1.210192 2.106918
O  -2.547635 2.534187 0.034183
O  -1.84478 -1.76967 1.330495
N  -1.896303 0.499759 0.912668
C  3.73934 1.523361 -0.413702
C  4.009909 0.223214 0.262007
C  2.583056 0.588042 -0.097055
C  3.927268 2.804196 0.361774
C  4.063726 1.663746 -1.882055
C  4.694701 -0.899862 -0.429302
C  1.616409 0.871058 0.981912
C  4.418667 -2.193836 -0.260626
C  -0.669363 0.873632 1.521614
C  5.186052 -3.256268 -0.987601
C  3.343579 -2.696609 0.652927
C  -3.782627 0.500116 -0.405313
C  -3.576796 -0.761402 -0.027741
C  -4.901206 0.961248 -1.264774
C  -4.440982 -1.912796 -0.389503
C  -5.557863 -0.245415 -1.937983
C  -5.766279 -1.399843 -0.957013
C  -2.70587 1.353291 0.165916
C  -2.352112 -0.813738 0.814987
H  4.219239 0.309227 1.325894
H  2.160114 0.076574 -0.954032
H  3.744136 2.684963 1.426485
H  3.263025 3.587241 -0.008674
H  4.952573 3.157835 0.238121
H  3.896297 0.740785 -2.437103
H  5.10882 1.948951 -2.02017
H  3.447516 2.440939 -2.336839
H  5.504518 -0.631484 -1.102049
H  -0.724729 1.91805 1.828765
H  -0.495276 0.250113 2.39852
H  5.688257 -3.927406 -0.286505
H  5.942537 -2.836401 -1.649517
H  4.519376 -3.878834 -1.589534
H  2.840172 -1.903987 1.200589
H  3.757685 -3.393691 1.384991
H  2.586048 -3.250748 0.093639
H  -5.626956 1.50632 -0.652372
H  -4.540768 1.679507 -2.004456
H  -3.920492 -2.537799 -1.12252
H  -4.604781 -2.553244 0.479953
H  -6.511236 0.050459 -2.378066
H  -4.926061 -0.583344 -2.764589
H  -6.299282 -2.216528 -1.445912
H  -6.403309 -1.062961 -0.134069
totalener: -1094.85609446 hartree
nucrepener: 2060.59804795 hartree
electener: -3155.45414242 hartree
oneelecener: -5583.00673540 hartree
twoeener: 2427.55259298 hartree
kineticenergy: 1090.09816810 hartree
xcener: -105.971052589687 hartree
chargesum: 0.0000000
charge: -0.261378 -0.388399 -0.316673 -0.317996 -0.128732 0.128039 -0.024128 -0.098903 -0.259478 -0.272688 -0.236821 0.326211 -0.006130 0.094279 -0.210949 -0.223208 -0.088219 -0.088843 -0.074814 -0.075205 -0.134651 -0.135510 0.261090 0.265532 0.106578 0.084203 0.101765 0.088107 0.083045 0.084385 0.089823 0.092906 0.092400 0.124276 0.121547 0.087655 0.078220 0.083665 0.085275 0.088844 0.088909 0.092754 0.094552 0.093445 0.094089 0.080029 0.075693 0.079983 0.075429
qa: -0.2614 -0.3884 -0.3167 -0.3180 -0.1287 0.1280 -0.0241 -0.0989 -0.2595 -0.2727 -0.2368 0.3262 -0.0061 0.0943 -0.2109 -0.2232 -0.0882 -0.0888 -0.0748 -0.0752 -0.1347 -0.1355 0.2611 0.2655 0.1066 0.0842 0.1018 0.0881 0.0830 0.0844 0.0898 0.0929 0.0924 0.1243 0.1215 0.0877 0.0782 0.0837 0.0853 0.0888 0.0889 0.0928 0.0946 0.0934 0.0941 0.0800 0.0757 0.0800 0.0754
va: 2.1087 2.1099 2.1979 2.1964 3.1180 3.7391 3.8285 3.8423 3.9025 3.9117 3.8931 4.1898 3.7355 3.8993 3.9410 3.9430 3.6277 3.6241 3.9252 3.9270 3.8991 3.8978 4.2772 4.2729 1.0252 1.0304 1.0203 1.0018 1.0020 1.0048 1.0014 1.0062 1.0100 1.0039 1.0037 0.9987 1.0096 0.9994 1.0170 1.0017 1.0015 1.0077 1.0192 1.0083 1.0188 1.0117 1.0089 1.0118 1.0087
dispcorr: -0.022465493 hartree
energy: -1094.878559958443
dipole: 16.25700 -17.29187 -1.03486 -8.37517 7.70356 -0.67161 -12.60151 11.40936 -1.19215
magnitude: 1.71558 au
magnitude: 4.36066 debye
