program: Orca
programVersion: 5.0.2
elementType: O O O O N C C C C C C C C C C C C C C C C C C C H H H H H H H H H H H H H H H H H H H H H H H H H
charge: 0
multiplicity: 1
keywords: wb97x-d3
keywords: def2-TZVPP
keywords: def2/J RIJCOSX
keywords: DEFGRID2
keywords: scfconv7
keywords: smallprint printgap noloewdin
keywords: NOSOSCF
formula: C19H25NO4
InChI: InChI=1/C19H25NO4/c1-11(2)9-14-15(19(14,3)4)18(23)24-10-20-16(21)12-7-5-6-8-13(12)17(20)22/h9,14-15H,5-8,10H2,1-4H3
49 atoms
O  0.428006 1.668063 -0.182214
O  1.643586 1.947529 1.685493
O  -2.951571 2.095628 -1.489012
O  -1.089859 -0.368448 1.850217
N  -1.788242 1.171315 0.280555
C  4.06298 1.206112 -0.145095
C  3.584843 -0.03882 0.519955
C  2.589357 0.840873 -0.213947
C  4.542948 2.352982 0.710353
C  4.805742 1.090752 -1.455234
C  3.916841 -1.388302 -0.004858
C  1.54782 1.54305 0.559398
C  3.067637 -2.409561 -0.128356
C  -0.751061 2.137636 0.443807
C  3.519364 -3.732998 -0.668271
C  1.619917 -2.338456 0.250826
C  -3.543937 -0.059257 -0.556953
C  -3.004265 -0.777326 0.427393
C  -4.728107 -0.46286 -1.355677
C  -3.481875 -2.108903 0.875957
C  -5.434807 -1.632622 -0.666852
C  -4.443444 -2.683929 -0.165982
C  -2.772639 1.206034 -0.704801
C  -1.845581 -0.028816 0.98261
H  3.511081 0.035082 1.602874
H  2.254872 0.469585 -1.175656
H  5.606857 2.227582 0.919529
H  4.021502 2.418568 1.660966
H  4.420273 3.306059 0.193037
H  4.45595 0.255078 -2.061301
H  5.8743 0.948363 -1.280849
H  4.68631 2.001897 -2.043518
H  4.953864 -1.547411 -0.288718
H  -1.065664 3.056731 -0.048375
H  -0.580764 2.325523 1.502714
H  3.380905 -4.52567 0.071244
H  4.569873 -3.723046 -0.956611
H  2.932518 -4.020029 -1.54469
H  0.982422 -2.429001 -0.633512
H  1.350849 -1.421217 0.766962
H  1.356717 -3.1711 0.90756
H  -5.404336 0.384848 -1.486458
H  -4.406421 -0.742178 -2.364324
H  -2.635236 -2.777822 1.046122
H  -3.977479 -2.007002 1.846945
H  -6.015526 -1.252442 0.178627
H  -6.149708 -2.088102 -1.353602
H  -3.867433 -3.069233 -1.012296
H  -4.979872 -3.534952 0.256186
totalener: -1094.85385322 hartree
nucrepener: 2115.38806863 hartree
electener: -3210.24192185 hartree
oneelecener: -5692.68954390 hartree
twoeener: 2482.44762205 hartree
kineticenergy: 1090.09374687 hartree
xcener: -105.971451318410 hartree
chargesum: 0.0000000
charge: -0.273155 -0.378164 -0.319863 -0.320862 -0.108340 0.133039 -0.009392 -0.144400 -0.262269 -0.267687 -0.247107 0.358126 0.001424 0.069931 -0.214007 -0.222778 -0.101197 -0.064695 -0.075368 -0.075232 -0.136053 -0.134980 0.269654 0.243698 0.108262 0.090050 0.082029 0.104156 0.083186 0.085294 0.088289 0.092281 0.092557 0.113571 0.139757 0.087979 0.078588 0.082639 0.081019 0.094716 0.088574 0.094225 0.093182 0.093329 0.093327 0.076401 0.080306 0.075854 0.080105
qa: -0.2732 -0.3782 -0.3199 -0.3209 -0.1083 0.1330 -0.0094 -0.1444 -0.2623 -0.2677 -0.2471 0.3581 0.0014 0.0699 -0.2140 -0.2228 -0.1012 -0.0647 -0.0754 -0.0752 -0.1361 -0.1350 0.2697 0.2437 0.1083 0.0900 0.0820 0.1042 0.0832 0.0853 0.0883 0.0923 0.0926 0.1136 0.1398 0.0880 0.0786 0.0826 0.0810 0.0947 0.0886 0.0942 0.0932 0.0933 0.0933 0.0764 0.0803 0.0759 0.0801
va: 2.0994 2.1258 2.1954 2.1838 3.0917 3.7253 3.8139 3.8540 3.9057 3.9068 3.9048 4.1681 3.7474 3.8799 3.9420 3.9413 3.6518 3.6125 3.9228 3.9286 3.8978 3.8978 4.2781 4.2659 1.0238 1.0308 1.0014 1.0228 1.0026 1.0054 1.0021 1.0061 1.0100 1.0116 1.0159 0.9987 1.0100 0.9989 0.9994 1.0144 1.0037 1.0192 1.0083 1.0186 1.0081 1.0084 1.0119 1.0086 1.0119
dispcorr: -0.024133806 hartree
energy: -1094.877987022946
dipole: 14.44211 -15.32674 -0.88463 -17.29803 16.05419 -1.24384 -5.85296 5.19781 -0.65515
magnitude: 1.66100 au
magnitude: 4.22194 debye
