program: Orca
programVersion: 5.0.2
elementType: O O O O N C C C C C C C C C C C C C C C C C C C H H H H H H H H H H H H H H H H H H H H H H H H H
charge: 0
multiplicity: 1
keywords: wb97x-d3
keywords: def2-TZVPP
keywords: def2/J RIJCOSX
keywords: DEFGRID2
keywords: scfconv7
keywords: smallprint printgap noloewdin
keywords: NOSOSCF
formula: C19H25NO4
InChI: InChI=1/C19H25NO4/c1-11(2)9-14-15(19(14,3)4)18(23)24-10-20-16(21)12-7-5-6-8-13(12)17(20)22/h9,14-15H,5-8,10H2,1-4H3
49 atoms
O  0.417848 1.870851 -1.054938
O  0.518925 1.214489 1.082208
O  -1.901833 0.343596 -2.535861
O  -2.451795 2.190304 1.588639
N  -1.867901 1.516308 -0.547741
C  3.547103 0.776126 0.416244
C  2.822465 -0.53163 0.337958
C  2.289538 0.654462 -0.428533
C  3.537569 1.541066 1.716835
C  4.833845 0.930338 -0.356993
C  3.362932 -1.699835 -0.402625
C  1.005628 1.257388 -0.015395
C  4.127765 -2.65143 0.134027
C  -0.84891 2.467853 -0.848793
C  4.609884 -3.816936 -0.675207
C  4.561076 -2.643093 1.568254
C  -3.220484 -0.342573 -0.624112
C  -3.364806 0.188853 0.58905
C  -3.90541 -1.569308 -1.104131
C  -4.252554 -0.340025 1.654118
C  -4.509979 -2.315081 0.087565
C  -5.216857 -1.366318 1.05646
C  -2.2657 0.492701 -1.402295
C  -2.52272 1.411679 0.682166
H  2.239537 -0.769909 1.223802
H  2.456938 0.653108 -1.500269
H  4.385408 1.22693 2.329297
H  2.631376 1.384065 2.295801
H  3.642233 2.613606 1.541369
H  5.030461 1.982476 -0.570067
H  4.821068 0.392535 -1.304085
H  5.674141 0.543917 0.223031
H  3.098221 -1.782241 -1.452858
H  -1.066345 2.972415 -1.787739
H  -0.825827 3.1954 -0.036202
H  5.701591 -3.866231 -0.681529
H  4.269877 -3.766853 -1.70888
H  4.258338 -4.761475 -0.252539
H  4.185768 -3.524921 2.093828
H  4.222406 -1.761382 2.108848
H  5.650679 -2.679707 1.641992
H  -4.682448 -1.293637 -1.824648
H  -3.206304 -2.20435 -1.652808
H  -3.640461 -0.792771 2.440731
H  -4.793631 0.477218 2.136153
H  -5.207198 -3.075363 -0.26772
H  -3.715148 -2.846871 0.61845
H  -5.695494 -1.933829 1.855889
H  -6.017264 -0.841436 0.526825
totalener: -1094.85274994 hartree
nucrepener: 2102.01377819 hartree
electener: -3196.86652813 hartree
oneelecener: -5666.19512151 hartree
twoeener: 2469.32859338 hartree
kineticenergy: 1090.09911751 hartree
xcener: -105.972047037148 hartree
chargesum: -0.0000000
charge: -0.263247 -0.385978 -0.315073 -0.306689 -0.126931 0.107861 -0.038727 -0.119670 -0.272532 -0.239863 -0.187182 0.351640 -0.030009 0.094118 -0.211820 -0.233745 -0.102279 -0.066121 -0.077210 -0.077478 -0.134175 -0.136557 0.243250 0.273472 0.104973 0.081947 0.081848 0.107531 0.087581 0.093942 0.081206 0.086154 0.093407 0.122431 0.125992 0.083919 0.079855 0.085464 0.093311 0.081082 0.084811 0.091039 0.092795 0.095491 0.092857 0.077798 0.076071 0.079431 0.074009
qa: -0.2632 -0.3860 -0.3151 -0.3067 -0.1269 0.1079 -0.0387 -0.1197 -0.2725 -0.2399 -0.1872 0.3516 -0.0300 0.0941 -0.2118 -0.2337 -0.1023 -0.0661 -0.0772 -0.0775 -0.1342 -0.1366 0.2433 0.2735 0.1050 0.0819 0.0818 0.1075 0.0876 0.0939 0.0812 0.0862 0.0934 0.1224 0.1260 0.0839 0.0799 0.0855 0.0933 0.0811 0.0848 0.0910 0.0928 0.0955 0.0929 0.0778 0.0761 0.0794 0.0740
va: 2.1303 2.1109 2.2022 2.2082 3.0754 3.6993 3.8234 3.8907 3.9062 3.9075 3.8547 4.2297 3.7340 3.9103 3.9408 3.9415 3.6478 3.6193 3.9285 3.9217 3.8987 3.8981 4.2827 4.2504 1.0249 1.0366 1.0014 1.0209 1.0035 1.0052 1.0072 1.0043 1.0133 0.9940 1.0156 0.9989 1.0107 0.9978 1.0013 1.0115 1.0004 1.0079 1.0190 1.0076 1.0204 1.0115 1.0084 1.0115 1.0084
dispcorr: -0.023428306 hartree
energy: -1094.876178246860
dipole: 22.05761 -22.15703 -0.09942 -19.08637 18.13800 -0.94837 6.47003 -6.48922 -0.01919
magnitude: 0.95376 au
magnitude: 2.42427 debye
