program: Orca
programVersion: 5.0.2
elementType: O O O O N C C C C C C C C C C C C C C C C C C C H H H H H H H H H H H H H H H H H H H H H H H H H
charge: 0
multiplicity: 1
keywords: wb97x-d3
keywords: def2-TZVPP
keywords: def2/J RIJCOSX
keywords: DEFGRID2
keywords: scfconv7
keywords: smallprint printgap noloewdin
keywords: NOSOSCF
formula: C19H25NO4
InChI: InChI=1/C19H25NO4/c1-11(2)9-14-15(19(14,3)4)18(23)24-10-20-16(21)12-7-5-6-8-13(12)17(20)22/h9,14-15H,5-8,10H2,1-4H3
49 atoms
O  0.593384 1.859002 -1.187122
O  0.308491 -0.317152 -1.614164
O  -2.705317 0.090949 -2.278189
O  -1.215023 2.671068 1.15685
N  -1.719608 1.57703 -0.807498
C  2.390049 -0.135204 0.870292
C  2.894017 -0.925171 -0.309514
C  2.305545 0.443134 -0.531014
C  1.13371 -0.602136 1.564686
C  3.376313 0.516841 1.807093
C  4.331264 -1.160705 -0.550883
C  0.985345 0.579344 -1.176514
C  4.883798 -2.355379 -0.783308
C  -0.718088 2.157967 -1.644533
C  6.35862 -2.497051 -1.00315
C  4.092783 -3.635712 -0.818446
C  -3.288755 0.135296 0.067892
C  -2.867341 0.903247 1.073143
C  -4.301961 -0.941638 0.183686
C  -3.352555 0.82302 2.47244
C  -4.519352 -1.277417 1.660607
C  -4.627578 -0.021292 2.524329
C  -2.573075 0.537888 -1.169398
C  -1.842338 1.839985 0.55106
H  2.240935 -1.743512 -0.595566
H  2.991675 1.260608 -0.729211
H  1.389317 -1.293168 2.370577
H  0.443636 -1.122831 0.901746
H  0.599778 0.239092 2.013242
H  3.735677 -0.201988 2.546672
H  2.903405 1.338526 2.348839
H  4.246002 0.923039 1.292006
H  4.979765 -0.289495 -0.532743
H  -0.877749 1.819913 -2.668359
H  -0.780679 3.243257 -1.618877
H  6.880648 -1.542194 -0.936901
H  6.569781 -2.929771 -1.984952
H  6.80196 -3.174836 -0.268113
H  3.179048 -3.548755 -1.407472
H  3.797052 -3.952761 0.184194
H  4.677178 -4.448778 -1.248985
H  -5.236429 -0.612749 -0.282587
H  -3.982882 -1.825045 -0.374637
H  -2.569658 0.384329 3.099887
H  -3.530668 1.824127 2.872347
H  -5.419737 -1.883887 1.768752
H  -3.68542 -1.890024 2.015286
H  -4.841763 -0.295588 3.55828
H  -5.472329 0.582412 2.180306
elementType: O N C H
totalener: -1094.87775109 hartree
nucrepener: 2137.11133735 hartree
electener: -3231.98908843 hartree
oneelecener: -5736.70505384 hartree
twoeener: 2504.71596541 hartree
cpcmener: -0.03280857 hartree
kineticenergy: 1090.03944970 hartree
xcener: -105.970831808281 hartree
chargesum: 0.0000000
charge: -0.271855 -0.445046 -0.400426 -0.408567 -0.096696 0.125909 0.026730 -0.110621 -0.280259 -0.272863 -0.291371 0.377924 -0.028179 0.082581 -0.217374 -0.279674 -0.037025 -0.085864 -0.077337 -0.069371 -0.135298 -0.138571 0.300661 0.293229 0.092406 0.097964 0.104026 0.090299 0.091402 0.097518 0.097898 0.087684 0.116769 0.133720 0.143556 0.084161 0.094055 0.097642 0.100174 0.106879 0.094480 0.100410 0.094112 0.101151 0.094389 0.080585 0.078909 0.080661 0.078513
qa: -0.2719 -0.4450 -0.4004 -0.4086 -0.0967 0.1259 0.0267 -0.1106 -0.2803 -0.2729 -0.2914 0.3779 -0.0282 0.0826 -0.2174 -0.2797 -0.0370 -0.0859 -0.0773 -0.0694 -0.1353 -0.1386 0.3007 0.2932 0.0924 0.0980 0.1040 0.0903 0.0914 0.0975 0.0979 0.0877 0.1168 0.1337 0.1436 0.0842 0.0941 0.0976 0.1002 0.1069 0.0945 0.1004 0.0941 0.1012 0.0944 0.0806 0.0789 0.0807 0.0785
va: 2.1184 2.0647 2.1155 2.1002 3.0647 3.7020 3.7949 3.8238 3.9023 3.9044 3.8756 4.2459 3.7246 3.8882 3.9201 3.9367 3.6233 3.6933 3.9157 3.9177 3.9141 3.9178 4.2178 4.1972 1.0268 1.0313 1.0015 1.0145 1.0083 1.0014 1.0025 1.0058 1.0096 1.0149 0.9926 1.0101 0.9938 0.9934 1.0012 0.9940 1.0031 1.0043 1.0157 1.0060 1.0156 1.0095 1.0070 1.0095 1.0059
dispcorr: -0.024803663 hartree
energy: -1094.902554749525
dipole: 17.60955 -17.98709 -0.37754 -18.18336 17.90989 -0.27347 13.68189 -12.18149 1.50040
magnitude: 1.57116 au
magnitude: 3.99356 debye
