program: Orca
programVersion: 5.0.2
elementType: O O O O N C C C C C C C C C C C C C C C C C C C H H H H H H H H H H H H H H H H H H H H H H H H H
charge: 0
multiplicity: 1
keywords: wb97x-d3
keywords: def2-TZVPP
keywords: def2/J RIJCOSX
keywords: DEFGRID2
keywords: scfconv7
keywords: smallprint printgap noloewdin
keywords: NOSOSCF
formula: C19H25NO4
InChI: InChI=1/C19H25NO4/c1-11(2)9-14-15(19(14,3)4)18(23)24-10-20-16(21)12-7-5-6-8-13(12)17(20)22/h9,14-15H,5-8,10H2,1-4H3
49 atoms
O  0.284505 1.363833 -0.785902
O  1.348734 2.014786 1.079783
O  -1.585737 0.321944 1.638876
O  -2.938424 1.617745 -2.499389
N  -2.00464 1.269829 -0.4172
C  3.782037 0.731885 -0.481462
C  3.342372 -0.152842 0.645287
C  2.315165 0.35089 -0.34175
C  4.245058 2.131545 -0.164433
C  4.507093 0.116127 -1.653143
C  3.653456 -1.601537 0.686716
C  1.299343 1.326019 0.091436
C  4.518505 -2.18404 1.522043
C  -0.872564 2.133576 -0.486813
C  4.743568 -3.665597 1.493053
C  5.32976 -1.442782 2.539843
C  -3.452906 -0.386234 0.266099
C  -3.849751 -0.000768 -0.947463
C  -4.118094 -1.422506 1.092892
C  -5.016584 -0.551215 -1.679168
C  -5.505392 -1.717822 0.519855
C  -5.480865 -1.843234 -1.003234
C  -2.249374 0.398022 0.637004
C  -2.922333 1.050071 -1.437975
H  3.311519 0.345504 1.60939
H  1.963283 -0.363871 -1.077981
H  4.024025 2.815457 -0.986787
H  5.327502 2.133981 -0.020615
H  3.798796 2.538553 0.740552
H  4.120745 -0.867905 -1.917217
H  5.569975 0.003811 -1.428276
H  4.422139 0.752612 -2.536188
H  3.12775 -2.231504 -0.025282
H  -1.024333 2.847113 -1.294194
H  -0.759569 2.67788 0.448597
H  4.120935 -4.16329 0.749447
H  4.52805 -4.114862 2.466429
H  5.787817 -3.900784 1.270204
H  5.18802 -0.36382 2.509159
H  6.395399 -1.638488 2.394169
H  5.091741 -1.78345 3.55123
H  -3.500347 -2.3265 1.102596
H  -4.186287 -1.095225 2.13318
H  -5.819545 0.193223 -1.687007
H  -4.761385 -0.72799 -2.726782
H  -5.896279 -2.634403 0.963998
H  -6.190848 -0.91508 0.806783
H  -6.472141 -2.111114 -1.371729
H  -4.810149 -2.658747 -1.288477
elementType: O N C H
totalener: -1094.87949885 hartree
nucrepener: 2055.84519529 hartree
electener: -3150.72469414 hartree
oneelecener: -5574.07913309 hartree
twoeener: 2423.35443894 hartree
cpcmener: -0.03183504 hartree
kineticenergy: 1090.03601696 hartree
xcener: -105.969697408357 hartree
chargesum: -0.0000000
charge: -0.282790 -0.456982 -0.408255 -0.409466 -0.100374 0.146977 0.007416 -0.152717 -0.288644 -0.260412 -0.270274 0.422782 -0.030926 0.079317 -0.227697 -0.251778 -0.060860 -0.081207 -0.073216 -0.071058 -0.134518 -0.134951 0.316706 0.320516 0.096016 0.092219 0.099367 0.095065 0.093301 0.088930 0.095801 0.098097 0.118816 0.124696 0.139952 0.088702 0.094152 0.093483 0.088392 0.094363 0.097709 0.101157 0.093077 0.100230 0.092995 0.080224 0.077582 0.080159 0.077927
qa: -0.2828 -0.4570 -0.4083 -0.4095 -0.1004 0.1470 0.0074 -0.1527 -0.2886 -0.2604 -0.2703 0.4228 -0.0309 0.0793 -0.2277 -0.2518 -0.0609 -0.0812 -0.0732 -0.0711 -0.1345 -0.1350 0.3167 0.3205 0.0960 0.0922 0.0994 0.0951 0.0933 0.0889 0.0958 0.0981 0.1188 0.1247 0.1400 0.0887 0.0942 0.0935 0.0884 0.0944 0.0977 0.1012 0.0931 0.1002 0.0930 0.0802 0.0776 0.0802 0.0779
va: 2.1084 2.0570 2.1098 2.1092 3.0974 3.6783 3.7662 3.8826 3.9058 3.9046 3.8789 4.1749 3.7129 3.8589 3.9262 3.9452 3.6553 3.6894 3.9217 3.9198 3.9139 3.9166 4.2266 4.2275 1.0277 1.0384 0.9995 1.0010 1.0174 1.0033 1.0033 1.0029 1.0085 1.0139 1.0180 1.0082 0.9953 0.9964 1.0082 0.9977 0.9975 1.0051 1.0155 1.0047 1.0157 1.0097 1.0068 1.0097 1.0067
dispcorr: -0.022265981 hartree
energy: -1094.901764835412
dipole: 21.82484 -22.67459 -0.84975 -16.72136 15.19332 -1.52804 3.74072 -4.29533 -0.55461
magnitude: 1.83428 au
magnitude: 4.66238 debye
