program: Orca
programVersion: 5.0.2
elementType: O O O O N C C C C C C C C C C C C C C C C C C C H H H H H H H H H H H H H H H H H H H H H H H H H
charge: 0
multiplicity: 1
keywords: wb97x-d3
keywords: def2-TZVPP
keywords: def2/J RIJCOSX
keywords: DEFGRID2
keywords: scfconv7
keywords: smallprint printgap noloewdin
keywords: NOSOSCF
formula: C19H25NO4
InChI: InChI=1/C19H25NO4/c1-11(2)9-14-15(19(14,3)4)18(23)24-10-20-16(21)12-7-5-6-8-13(12)17(20)22/h9,14-15H,5-8,10H2,1-4H3
49 atoms
O  0.211479 1.367743 0.061721
O  1.516201 1.17721 1.873177
O  -3.08823 2.62829 -0.948472
O  -1.590576 -0.837847 1.576054
N  -2.0550 1.121179 0.460383
C  3.746338 0.946636 -0.343165
C  3.457223 -0.391492 0.262846
C  2.310912 0.442423 -0.258704
C  4.229523 2.062073 0.549494
C  4.339037 0.997824 -1.729645
C  3.799735 -1.666105 -0.417232
C  1.341258 1.01922 0.68979
C  4.88787 -2.396946 -0.159738
C  -0.888174 1.851634 0.824599
C  5.142463 -3.691488 -0.868944
C  5.929842 -2.003626 0.841845
C  -4.01773 0.433011 -0.524728
C  -3.582254 -0.584907 0.219524
C  -5.265786 0.431468 -1.326553
C  -4.278436 -1.884638 0.380143
C  -5.79101 -1.000279 -1.450942
C  -5.717082 -1.755413 -0.124109
C  -3.047265 1.551578 -0.411691
C  -2.302607 -0.186695 0.855517
H  3.532952 -0.409436 1.346564
H  1.885436 0.13653 -1.208627
H  3.890943 1.969213 1.579595
H  3.906777 3.03609 0.174144
H  5.322012 2.065951 0.566341
H  5.422148 0.859499 -1.683816
H  4.149386 1.966753 -2.196384
H  3.938035 0.228321 -2.389717
H  3.10354 -2.025527 -1.169873
H  -1.041942 2.903311 0.588506
H  -0.705167 1.752168 1.89278
H  4.348885 -3.938736 -1.574332
H  5.229181 -4.518261 -0.158483
H  6.08619 -3.659561 -1.420143
H  5.766877 -1.015477 1.269909
H  6.922732 -2.005321 0.384268
H  5.971148 -2.722497 1.665254
H  -6.005808 1.075693 -0.840137
H  -5.088776 0.870189 -2.31157
H  -3.738489 -2.654972 -0.180492
H  -4.256477 -2.203618 1.424996
H  -6.819605 -0.981573 -1.814735
H  -5.203269 -1.534166 -2.203758
H  -6.157598 -2.747819 -0.23195
H  -6.314169 -1.22874 0.62634
elementType: O N C H
totalener: -1094.87915228 hartree
nucrepener: 2045.40320923 hartree
electener: -3140.28236152 hartree
oneelecener: -5553.10070460 hartree
twoeener: 2412.81834308 hartree
cpcmener: -0.03093563 hartree
kineticenergy: 1090.02929216 hartree
xcener: -105.968029095340 hartree
chargesum: 0.0000000
charge: -0.282136 -0.460654 -0.409517 -0.410331 -0.097122 0.135865 -0.009144 -0.138513 -0.294121 -0.265870 -0.253698 0.421235 -0.036561 0.079285 -0.228869 -0.251042 -0.084272 -0.059541 -0.071425 -0.073627 -0.135596 -0.135217 0.321618 0.316703 0.099617 0.093425 0.095348 0.100821 0.095329 0.095973 0.099240 0.091316 0.120114 0.125897 0.139869 0.088816 0.093963 0.093761 0.087931 0.094096 0.101062 0.100767 0.093680 0.101112 0.092943 0.080343 0.077940 0.080919 0.078267
qa: -0.2821 -0.4607 -0.4095 -0.4103 -0.0971 0.1359 -0.0091 -0.1385 -0.2941 -0.2659 -0.2537 0.4212 -0.0366 0.0793 -0.2289 -0.2510 -0.0843 -0.0595 -0.0714 -0.0736 -0.1356 -0.1352 0.3216 0.3167 0.0996 0.0934 0.0953 0.1008 0.0953 0.0960 0.0992 0.0913 0.1201 0.1259 0.1399 0.0888 0.0940 0.0938 0.0879 0.0941 0.1011 0.1008 0.0937 0.1011 0.0929 0.0803 0.0779 0.0809 0.0783
va: 2.1087 2.0520 2.1093 2.1073 3.0999 3.6806 3.7820 3.8737 3.9014 3.9062 3.8654 4.1793 3.7046 3.8484 3.9284 3.9408 3.6962 3.6579 3.9190 3.9221 3.9163 3.9135 4.2275 4.2238 1.0255 1.0363 1.0176 0.9998 1.0006 1.0021 1.0030 1.0026 1.0074 1.0125 1.0179 1.0080 0.9952 0.9963 1.0075 0.9982 0.9979 1.0047 1.0155 1.0049 1.0155 1.0096 1.0066 1.0095 1.0067
dispcorr: -0.022356610 hartree
energy: -1094.901508894859
dipole: 22.60349 -23.57642 -0.97294 -13.81154 12.85350 -0.95804 -7.59298 6.36367 -1.22932
magnitude: 1.83730 au
magnitude: 4.67004 debye
