program: Orca
programVersion: 5.0.2
elementType: O O O O N C C C C C C C C C C C C C C C C C C C H H H H H H H H H H H H H H H H H H H H H H H H H
charge: 0
multiplicity: 1
keywords: wb97x-d3
keywords: def2-TZVPP
keywords: def2/J RIJCOSX
keywords: DEFGRID2
keywords: scfconv7
keywords: smallprint printgap noloewdin
keywords: NOSOSCF
formula: C19H25NO4
InChI: InChI=1/C19H25NO4/c1-11(2)9-14-15(19(14,3)4)18(23)24-10-20-16(21)12-7-5-6-8-13(12)17(20)22/h9,14-15H,5-8,10H2,1-4H3
49 atoms
O  0.20311 1.01145 0.29827
O  1.738625 1.298665 1.892882
O  -2.781874 2.547882 -0.669609
O  -1.892645 -1.202918 1.734665
N  -2.050359 0.864271 0.727355
C  3.735886 1.132531 -0.511864
C  3.675007 -0.20478 0.160317
C  2.386374 0.478405 -0.262246
C  4.177577 2.325761 0.299683
C  4.168179 1.213455 -1.955961
C  4.07143 -1.455979 -0.518712
C  1.453634 0.969761 0.766202
C  4.956202 -2.355049 -0.075911
C  -0.830719 1.424148 1.191119
C  5.254984 -3.591245 -0.869861
C  5.728021 -2.236809 1.20221
C  -3.965686 0.444232 -0.479625
C  -3.707772 -0.655333 0.229857
C  -5.118753 0.615818 -1.396303
C  -4.539742 -1.882787 0.238128
C  -5.754832 -0.747559 -1.675379
C  -5.895416 -1.584579 -0.404717
C  -2.905311 1.44563 -0.202413
C  -2.462305 -0.435595 1.003156
H  3.862169 -0.167172 1.228491
H  1.906066 0.078153 -1.148444
H  3.983653 2.220153 1.364305
H  3.68735 3.239234 -0.043815
H  5.253553 2.467304 0.1785
H  5.257817 1.199047 -2.027418
H  3.819876 2.143843 -2.408515
H  3.787101 0.392109 -2.561628
H  3.587046 -1.655483 -1.470466
H  -0.904637 2.511288 1.195878
H  -0.638617 1.078251 2.205386
H  4.679577 -3.638278 -1.794296
H  5.034613 -4.492187 -0.290821
H  6.31544 -3.645264 -1.130202
H  5.563071 -3.111061 1.836232
H  5.48365 -1.352286 1.786169
H  6.80093 -2.20617 0.996385
H  -5.844625 1.296944 -0.940321
H  -4.799494 1.095768 -2.324516
H  -4.016553 -2.676267 -0.305382
H  -4.663889 -2.251039 1.259296
H  -6.731369 -0.606028 -2.140332
H  -5.139431 -1.289359 -2.399376
H  -6.406811 -2.521811 -0.628618
H  -6.52381 -1.049917 0.313376
elementType: O N C H
totalener: -1094.88099119 hartree
nucrepener: 2033.57097183 hartree
electener: -3128.45196303 hartree
oneelecener: -5529.25524374 hartree
twoeener: 2400.80328071 hartree
cpcmener: -0.03058317 hartree
kineticenergy: 1090.04526203 hartree
xcener: -105.971265405146 hartree
chargesum: 0.0000000
charge: -0.277046 -0.470079 -0.408016 -0.408890 -0.111936 0.115943 0.038770 -0.111477 -0.281664 -0.264079 -0.272597 0.407599 -0.046265 0.089216 -0.219696 -0.250540 -0.079961 -0.063791 -0.072452 -0.074441 -0.135513 -0.135243 0.321720 0.318670 0.093554 0.087188 0.094300 0.098798 0.094291 0.096495 0.097823 0.088009 0.117446 0.135684 0.126321 0.087936 0.093566 0.092596 0.094825 0.088965 0.096214 0.100859 0.093698 0.101131 0.094217 0.080516 0.078222 0.080957 0.078158
qa: -0.2770 -0.4701 -0.4080 -0.4089 -0.1119 0.1159 0.0388 -0.1115 -0.2817 -0.2641 -0.2726 0.4076 -0.0463 0.0892 -0.2197 -0.2505 -0.0800 -0.0638 -0.0725 -0.0744 -0.1355 -0.1352 0.3217 0.3187 0.0936 0.0872 0.0943 0.0988 0.0943 0.0965 0.0978 0.0880 0.1174 0.1357 0.1263 0.0879 0.0936 0.0926 0.0948 0.0890 0.0962 0.1009 0.0937 0.1011 0.0942 0.0805 0.0782 0.0810 0.0782
va: 2.1131 2.0345 2.1091 2.1069 3.1258 3.6840 3.7660 3.8821 3.9026 3.9095 3.8700 4.1423 3.7572 3.8731 3.9219 3.9434 3.6858 3.6605 3.9205 3.9221 3.9154 3.9138 4.2201 4.2185 1.0314 1.0366 1.0195 0.9991 1.0003 1.0025 1.0023 1.0054 1.0103 1.0020 1.0119 1.0091 0.9963 0.9963 0.9973 1.0102 0.9972 1.0045 1.0157 1.0051 1.0149 1.0097 1.0067 1.0097 1.0068
dispcorr: -0.021535751 hartree
energy: -1094.902526945898
dipole: 21.55434 -22.71044 -1.15610 -11.81769 10.85057 -0.96711 -9.60374 8.25034 -1.35340
magnitude: 2.02573 au
magnitude: 5.14899 debye
