program: Orca
programVersion: 5.0.2
elementType: O O O O N C C C C C C C C C C C C C C C C C C C H H H H H H H H H H H H H H H H H H H H H H H H H
charge: 0
multiplicity: 1
keywords: wb97x-d3
keywords: def2-TZVPP
keywords: def2/J RIJCOSX
keywords: DEFGRID2
keywords: scfconv7
keywords: smallprint printgap noloewdin
keywords: NOSOSCF
formula: C19H25NO4
InChI: InChI=1/C19H25NO4/c1-11(2)9-14-15(19(14,3)4)18(23)24-10-20-16(21)12-7-5-6-8-13(12)17(20)22/h9,14-15H,5-8,10H2,1-4H3
49 atoms
O  0.240834 1.068522 -0.601001
O  1.504275 2.075482 0.949387
O  -1.800394 0.09828 1.706747
O  -2.900518 1.623615 -2.427846
N  -2.053456 1.114794 -0.341822
C  3.78574 0.545905 -0.60034
C  3.483186 -0.140845 0.694704
C  2.3487 0.182378 -0.247371
C  4.25062 1.980398 -0.574923
C  4.402003 -0.258026 -1.718414
C  3.839461 -1.56172 0.943209
C  1.35835 1.209158 0.121437
C  4.977192 -1.969364 1.511516
C  -0.873097 1.909482 -0.321872
C  5.254881 -3.422139 1.74815
C  6.057044 -1.032193 1.956572
C  -3.689988 -0.385775 0.269375
C  -4.008528 0.062471 -0.945797
C  -4.495056 -1.346527 1.062817
C  -5.212844 -0.335688 -1.714369
C  -5.897398 -1.44897 0.460434
C  -5.855839 -1.562154 -1.062964
C  -2.42059 0.257066 0.68716
C  -2.965506 1.024234 -1.385982
H  3.538274 0.510539 1.563047
H  1.943931 -0.648798 -0.81515
H  5.342399 2.009104 -0.550086
H  3.893531 2.534116 0.290864
H  3.931862 2.515075 -1.472643
H  4.209328 0.213238 -2.684428
H  4.020097 -1.277879 -1.7649
H  5.48559 -0.318408 -1.591048
H  3.114454 -2.312375 0.64141
H  -0.946313 2.674875 -1.093305
H  -0.770562 2.393954 0.647502
H  5.424934 -3.622801 2.80956
H  6.162242 -3.738557 1.226556
H  4.435684 -4.059016 1.413841
H  5.853208 0.008945 1.710758
H  7.012659 -1.300095 1.498078
H  6.207849 -1.096965 3.037826
H  -3.999821 -2.323069 1.061446
H  -4.539617 -1.03412 2.108873
H  -5.915586 0.50371 -1.739096
H  -4.951713 -0.538393 -2.755954
H  -6.416436 -2.309157 0.885871
H  -6.474862 -0.563938 0.743339
H  -6.864879 -1.696495 -1.455672
H  -5.291206 -2.456206 -1.343427
elementType: O N C H
totalener: -1094.87904951 hartree
nucrepener: 2039.77930839 hartree
electener: -3134.65835790 hartree
oneelecener: -5541.78340534 hartree
twoeener: 2407.12504744 hartree
cpcmener: -0.03053231 hartree
kineticenergy: 1090.03588277 hartree
xcener: -105.969074359169 hartree
chargesum: 0.0000000
charge: -0.280724 -0.462855 -0.410371 -0.409370 -0.096699 0.123450 -0.016606 -0.121930 -0.294842 -0.270208 -0.242590 0.416572 -0.043380 0.079023 -0.227404 -0.247782 -0.059793 -0.085219 -0.074512 -0.070742 -0.134091 -0.136789 0.317727 0.320877 0.100641 0.094428 0.095368 0.095880 0.102458 0.100493 0.091984 0.096050 0.119130 0.127482 0.137892 0.094114 0.093703 0.089043 0.086441 0.095012 0.102068 0.101059 0.092544 0.100515 0.094099 0.081083 0.077794 0.081124 0.077852
qa: -0.2807 -0.4629 -0.4104 -0.4094 -0.0967 0.1235 -0.0166 -0.1219 -0.2948 -0.2702 -0.2426 0.4166 -0.0434 0.0790 -0.2274 -0.2478 -0.0598 -0.0852 -0.0745 -0.0707 -0.1341 -0.1368 0.3177 0.3209 0.1006 0.0944 0.0954 0.0959 0.1025 0.1005 0.0920 0.0960 0.1191 0.1275 0.1379 0.0941 0.0937 0.0890 0.0864 0.0950 0.1021 0.1011 0.0925 0.1005 0.0941 0.0811 0.0778 0.0811 0.0779
va: 2.1070 2.0482 2.1064 2.1089 3.1028 3.6826 3.8004 3.8555 3.8995 3.9071 3.8543 4.1793 3.7102 3.8498 3.9280 3.9374 3.6608 3.6987 3.9237 3.9195 3.9127 3.9169 4.2198 4.2264 1.0249 1.0350 1.0006 1.0178 0.9995 1.0032 1.0026 1.0012 1.0071 1.0105 1.0163 0.9953 0.9964 1.0076 1.0081 0.9980 0.9986 1.0048 1.0156 1.0049 1.0152 1.0097 1.0070 1.0094 1.0066
dispcorr: -0.022410523 hartree
energy: -1094.901460031326
dipole: 22.79471 -23.77352 -0.97881 -14.99928 13.50701 -1.49227 2.05940 -2.61544 -0.55605
magnitude: 1.86926 au
magnitude: 4.75127 debye
