program: Orca
programVersion: 5.0.2
elementType: O O O O N C C C C C C C C C C C C C C C C C C C H H H H H H H H H H H H H H H H H H H H H H H H H
charge: 0
multiplicity: 1
keywords: wb97x-d3
keywords: def2-TZVPP
keywords: def2/J RIJCOSX
keywords: DEFGRID2
keywords: scfconv7
keywords: smallprint printgap noloewdin
keywords: NOSOSCF
formula: C19H25NO4
InChI: InChI=1/C19H25NO4/c1-11(2)9-14-15(19(14,3)4)18(23)24-10-20-16(21)12-7-5-6-8-13(12)17(20)22/h9,14-15H,5-8,10H2,1-4H3
49 atoms
O  0.203717 0.497256 0.530659
O  1.766302 0.939202 2.057634
O  -2.518137 2.543197 0.047579
O  -2.198472 -1.829347 1.23822
N  -2.058816 0.444284 0.884643
C  3.587541 1.265707 -0.491562
C  3.82174 -0.078909 0.125224
C  2.401731 0.367703 -0.182896
C  3.861196 2.493537 0.342346
C  3.877048 1.480352 -1.957815
C  4.385637 -1.220911 -0.619575
C  1.470815 0.637287 0.925393
C  5.27628 -2.109612 -0.1665
C  -0.81234 0.702058 1.511919
C  5.744108 -3.234227 -1.041443
C  5.876247 -2.099068 1.206724
C  -3.950842 0.645718 -0.411443
C  -3.861836 -0.636545 -0.054883
C  -5.02516 1.223535 -1.254734
C  -4.834587 -1.694615 -0.420527
C  -5.800596 0.093191 -1.934051
C  -6.10917 -1.047946 -0.965743
C  -2.79459 1.377428 0.162392
C  -2.635699 -0.815284 0.76034
H  4.069233 -0.037185 1.180416
H  1.938789 -0.083924 -1.053435
H  3.768643 2.318525 1.411793
H  3.18709 3.309566 0.073377
H  4.880674 2.838099 0.157198
H  4.939533 1.679487 -2.112969
H  3.321635 2.342703 -2.331868
H  3.606225 0.626392 -2.577417
H  4.022318 -1.352105 -1.634825
H  -0.7949 1.728173 1.878629
H  -0.681649 0.021376 2.352932
H  5.549183 -4.203266 -0.573497
H  6.824291 -3.183729 -1.203785
H  5.257813 -3.229592 -2.017016
H  6.962324 -2.20777 1.151496
H  5.512388 -2.948359 1.792509
H  5.667123 -1.193803 1.773816
H  -5.689014 1.829758 -0.629848
H  -4.601915 1.907077 -1.994791
H  -4.384221 -2.356775 -1.167304
H  -5.054399 -2.324643 0.444729
H  -6.725914 0.487417 -2.35643
H  -5.213018 -0.291995 -2.772546
H  -6.719982 -1.804652 -1.460032
H  -6.702368 -0.663152 -0.131193
elementType: O N C H
totalener: -1094.88174191 hartree
nucrepener: 2028.77904536 hartree
electener: -3123.66078727 hartree
oneelecener: -5519.60754387 hartree
twoeener: 2395.94675660 hartree
cpcmener: -0.03052355 hartree
kineticenergy: 1090.04040924 hartree
xcener: -105.970120635564 hartree
chargesum: -0.0000000
charge: -0.275542 -0.471554 -0.407813 -0.407063 -0.116238 0.096124 0.045681 -0.081774 -0.273797 -0.269265 -0.274727 0.396383 -0.045366 0.092851 -0.217355 -0.256556 -0.069964 -0.074249 -0.071541 -0.071307 -0.134146 -0.136298 0.317265 0.319843 0.090901 0.086337 0.092892 0.098415 0.095124 0.097053 0.097896 0.087478 0.115606 0.131820 0.129481 0.092254 0.093339 0.087437 0.092565 0.100602 0.091069 0.099657 0.093446 0.101687 0.093537 0.080278 0.078253 0.081240 0.078045
qa: -0.2755 -0.4716 -0.4078 -0.4071 -0.1162 0.0961 0.0457 -0.0818 -0.2738 -0.2693 -0.2747 0.3964 -0.0454 0.0929 -0.2174 -0.2566 -0.0700 -0.0742 -0.0715 -0.0713 -0.1341 -0.1363 0.3173 0.3198 0.0909 0.0863 0.0929 0.0984 0.0951 0.0971 0.0979 0.0875 0.1156 0.1318 0.1295 0.0923 0.0933 0.0874 0.0926 0.1006 0.0911 0.0997 0.0934 0.1017 0.0935 0.0803 0.0783 0.0812 0.0780
va: 2.1136 2.0347 2.1105 2.1114 3.1294 3.7031 3.7681 3.8523 3.9025 3.9126 3.8891 4.1479 3.7594 3.8847 3.9218 3.9415 3.6705 3.6689 3.9212 3.9218 3.9148 3.9144 4.2174 4.2168 1.0324 1.0343 1.0190 0.9995 1.0003 1.0017 1.0015 1.0068 1.0120 1.0024 1.0024 0.9957 0.9965 1.0092 0.9980 0.9953 1.0091 1.0049 1.0154 1.0049 1.0151 1.0095 1.0070 1.0095 1.0069
dispcorr: -0.021414280 hartree
energy: -1094.903156186800
dipole: 21.17715 -22.44333 -1.26618 -6.47607 5.91567 -0.56041 -11.63480 10.08370 -1.55110
magnitude: 2.07923 au
magnitude: 5.28497 debye
