program: Orca
programVersion: 5.0.2
elementType: O O O O N C C C C C C C C C C C C C C C C C C C H H H H H H H H H H H H H H H H H H H H H H H H H
charge: 0
multiplicity: 1
keywords: wb97x-d3
keywords: def2-TZVPP
keywords: def2/J RIJCOSX
keywords: DEFGRID2
keywords: scfconv7
keywords: smallprint printgap noloewdin
keywords: NOSOSCF
formula: C19H25NO4
InChI: InChI=1/C19H25NO4/c1-11(2)9-14-15(19(14,3)4)18(23)24-10-20-16(21)12-7-5-6-8-13(12)17(20)22/h9,14-15H,5-8,10H2,1-4H3
49 atoms
O  0.650431 0.507458 -1.47681
O  0.914627 2.53003 -0.556266
O  -1.733641 -1.636643 -1.268381
O  -2.236817 2.831434 -0.594645
N  -1.679637 0.664621 -1.176872
C  2.387534 -0.132057 1.111043
C  2.986444 -0.565859 -0.198663
C  2.493371 0.848249 -0.044761
C  1.039479 -0.683738 1.50673
C  3.299644 0.118683 2.285479
C  4.442276 -0.805422 -0.352968
C  1.287241 1.392174 -0.700776
C  5.024521 -2.006295 -0.407535
C  -0.586867 0.877173 -2.070625
C  6.505286 -2.141504 -0.593961
C  4.279282 -3.300984 -0.294095
C  -3.235717 -0.386329 0.161113
C  -3.371971 0.924308 0.364544
C  -4.037718 -1.442769 0.825558
C  -4.356617 1.546236 1.282932
C  -4.778128 -0.841904 2.021879
C  -5.407537 0.509365 1.684063
C  -2.152428 -0.59651 -0.829012
C  -2.38945 1.643836 -0.486419
H  2.346286 -1.220178 -0.781297
H  3.251023 1.614211 0.090064
H  0.459418 0.051664 2.068295
H  1.171481 -1.555058 2.151281
H  0.442642 -1.006419 0.655681
H  2.820013 0.774934 3.014395
H  4.242001 0.581699 1.99504
H  3.535921 -0.819946 2.791444
H  5.074944 0.074602 -0.430352
H  -0.691582 0.230958 -2.938366
H  -0.588383 1.914225 -2.4008
H  6.999888 -1.17367 -0.676583
H  6.737407 -2.715236 -1.495314
H  6.959068 -2.682721 0.240634
H  4.36884 -3.884186 -1.214549
H  3.21925 -3.175463 -0.079831
H  4.705108 -3.917934 0.501307
H  -4.744715 -1.86587 0.104662
H  -3.39573 -2.269914 1.137433
H  -3.83177 1.927231 2.165051
H  -4.822723 2.415269 0.812693
H  -5.545469 -1.537436 2.3643
H  -4.076542 -0.717142 2.851586
H  -5.978292 0.879765 2.536668
H  -6.118642 0.383012 0.862753
elementType: O N C H
totalener: -1094.87765762 hartree
nucrepener: 2122.39965990 hartree
electener: -3217.27731751 hartree
oneelecener: -5706.90390787 hartree
twoeener: 2489.62659035 hartree
cpcmener: -0.03465290 hartree
kineticenergy: 1090.03748211 hartree
xcener: -105.969551993593 hartree
chargesum: -0.0000000
charge: -0.267423 -0.447731 -0.407529 -0.399236 -0.074030 0.143937 0.033641 -0.150224 -0.294392 -0.270451 -0.291150 0.408983 -0.026116 0.052162 -0.229024 -0.253719 -0.039102 -0.069029 -0.072744 -0.069507 -0.135240 -0.137338 0.263873 0.308383 0.099873 0.096872 0.105312 0.099064 0.083745 0.099250 0.090715 0.094691 0.119114 0.139274 0.131351 0.088535 0.093649 0.093838 0.099447 0.088169 0.094787 0.100339 0.093419 0.101111 0.092638 0.080915 0.078343 0.080885 0.077671
qa: -0.2674 -0.4477 -0.4075 -0.3992 -0.0740 0.1439 0.0336 -0.1502 -0.2944 -0.2705 -0.2911 0.4090 -0.0261 0.0522 -0.2290 -0.2537 -0.0391 -0.0690 -0.0727 -0.0695 -0.1352 -0.1373 0.2639 0.3084 0.0999 0.0969 0.1053 0.0991 0.0837 0.0992 0.0907 0.0947 0.1191 0.1393 0.1314 0.0885 0.0936 0.0938 0.0994 0.0882 0.0948 0.1003 0.0934 0.1011 0.0926 0.0809 0.0783 0.0809 0.0777
va: 2.1167 2.0580 2.1016 2.1162 3.0650 3.6854 3.7379 3.9062 3.9134 3.9019 3.8644 4.2015 3.7068 3.9164 3.9284 3.9441 3.6510 3.6683 3.9182 3.9163 3.9136 3.9170 4.2138 4.2040 1.0201 1.0315 1.0000 1.0024 1.0141 1.0024 1.0029 1.0027 1.0085 1.0006 1.0174 1.0082 0.9953 0.9964 0.9975 1.0078 0.9980 1.0049 1.0157 1.0049 1.0163 1.0095 1.0070 1.0094 1.0065
dispcorr: -0.024758522 hartree
energy: -1094.902416137791
dipole: 15.76713 -16.61842 -0.85129 -16.43488 14.77044 -1.66444 15.19095 -14.16836 1.02259
magnitude: 2.13090 au
magnitude: 5.41633 debye
