program: Orca
programVersion: 5.0.2
elementType: O O O O N C C C C C C C C C C C C C C C C C C C H H H H H H H H H H H H H H H H H H H H H H H H H
charge: 0
multiplicity: 1
keywords: wb97x-d3
keywords: def2-TZVPP
keywords: def2/J RIJCOSX
keywords: DEFGRID2
keywords: scfconv7
keywords: smallprint printgap noloewdin
keywords: NOSOSCF
formula: C19H25NO4
InChI: InChI=1/C19H25NO4/c1-11(2)9-14-15(19(14,3)4)18(23)24-10-20-16(21)12-7-5-6-8-13(12)17(20)22/h9,14-15H,5-8,10H2,1-4H3
49 atoms
O  0.595416 0.866784 -0.689322
O  1.909188 2.35317 -1.702662
O  -2.203267 -0.689745 -2.144077
O  -1.70417 2.167054 1.351861
N  -1.696104 0.952743 -0.606224
C  3.072275 0.603506 1.194734
C  2.846316 -0.618251 0.369034
C  2.922114 0.730149 -0.315842
C  1.975302 1.073296 2.119094
C  4.456214 0.897411 1.721395
C  3.915628 -1.625337 0.135855
C  1.784597 1.39955 -0.968734
C  4.099574 -2.297375 -1.003231
C  -0.553125 1.52894 -1.21845
C  5.190816 -3.313951 -1.144112
C  3.255285 -2.097094 -2.224148
C  -3.456339 -0.437342 -0.087468
C  -3.299882 0.389501 0.947386
C  -4.505955 -1.479542 -0.196336
C  -4.122712 0.382386 2.180772
C  -5.568269 -1.247515 0.880482
C  -4.9493 -0.90407 2.23504
C  -2.413254 -0.132533 -1.098554
C  -2.162377 1.296233 0.658324
H  1.842464 -1.028572 0.445653
H  3.850475 0.944347 -0.834013
H  2.143816 0.66771 3.119028
H  0.983324 0.752032 1.809011
H  1.966417 2.161626 2.205891
H  5.241997 0.596596 1.02819
H  4.631176 0.380402 2.667436
H  4.573923 1.967139 1.906007
H  4.572614 -1.840139 0.974702
H  -0.611261 1.389483 -2.297718
H  -0.521921 2.595585 -0.998913
H  4.779458 -4.305783 -1.349932
H  5.806986 -3.385215 -0.247672
H  5.845712 -3.07181 -1.985468
H  2.398335 -1.446839 -2.056081
H  2.87852 -3.054658 -2.592843
H  3.847243 -1.667322 -3.037293
H  -4.952676 -1.464034 -1.193534
H  -4.048804 -2.468329 -0.087527
H  -3.481601 0.471331 3.061347
H  -4.770864 1.264489 2.190914
H  -6.226235 -0.432213 0.566387
H  -6.194852 -2.135848 0.971411
H  -4.309188 -1.729096 2.560475
H  -5.732565 -0.802332 2.987462
elementType: O N C H
totalener: -1094.87804846 hartree
nucrepener: 2102.75375333 hartree
electener: -3197.63180179 hartree
oneelecener: -5667.23717869 hartree
twoeener: 2469.60537690 hartree
cpcmener: -0.03048631 hartree
kineticenergy: 1090.03870441 hartree
xcener: -105.969217749758 hartree
chargesum: -0.0000000
charge: -0.271825 -0.466116 -0.408759 -0.410325 -0.104330 0.148293 0.022562 -0.122207 -0.274377 -0.289310 -0.318133 0.400666 -0.007843 0.070653 -0.229108 -0.239656 -0.084206 -0.041977 -0.071614 -0.071966 -0.136631 -0.135684 0.324340 0.294681 0.106232 0.095260 0.095608 0.079867 0.104113 0.092798 0.097356 0.098729 0.120430 0.133660 0.131822 0.096185 0.088865 0.093569 0.079597 0.098849 0.100598 0.093997 0.101819 0.094108 0.101157 0.078382 0.080740 0.078391 0.080741
qa: -0.2718 -0.4661 -0.4088 -0.4103 -0.1043 0.1483 0.0226 -0.1222 -0.2744 -0.2893 -0.3181 0.4007 -0.0078 0.0707 -0.2291 -0.2397 -0.0842 -0.0420 -0.0716 -0.0720 -0.1366 -0.1357 0.3243 0.2947 0.1062 0.0953 0.0956 0.0799 0.1041 0.0928 0.0974 0.0987 0.1204 0.1337 0.1318 0.0962 0.0889 0.0936 0.0796 0.0988 0.1006 0.0940 0.1018 0.0941 0.1012 0.0784 0.0807 0.0784 0.0807
va: 2.0840 2.0372 2.1074 2.0995 3.1249 3.6931 3.7771 3.8568 3.9066 3.9125 3.8950 4.1138 3.7001 3.8965 3.9322 3.9346 3.7040 3.6734 3.9185 3.9187 3.9160 3.9148 4.2022 4.1974 1.0184 1.0280 1.0028 1.0106 0.9994 1.0022 1.0001 1.0022 1.0037 1.0047 1.0046 0.9963 1.0064 0.9966 1.0172 1.0003 0.9982 1.0151 1.0052 1.0152 1.0049 1.0065 1.0097 1.0066 1.0097
dispcorr: -0.023865739 hartree
energy: -1094.901914200741
dipole: 13.70600 -15.13107 -1.42507 -14.77297 13.18157 -1.59139 9.10437 -7.74443 1.35994
magnitude: 2.53235 au
magnitude: 6.43672 debye
