program: Orca
programVersion: 5.0.2
elementType: O O O O N C C C C C C C C C C C C C C C C C C C H H H H H H H H H H H H H H H H H H H H H H H H H
charge: 0
multiplicity: 1
keywords: wb97x-d3
keywords: def2-TZVPP
keywords: def2/J RIJCOSX
keywords: DEFGRID2
keywords: scfconv7
keywords: smallprint printgap noloewdin
keywords: NOSOSCF
formula: C19H25NO4
InChI: InChI=1/C19H25NO4/c1-11(2)9-14-15(19(14,3)4)18(23)24-10-20-16(21)12-7-5-6-8-13(12)17(20)22/h9,14-15H,5-8,10H2,1-4H3
49 atoms
O  0.617614 0.985001 -0.689414
O  1.929501 2.188058 -2.02852
O  -1.961329 2.165748 1.07153
O  -1.879309 -0.931767 -2.251339
N  -1.666228 0.84262 -0.792712
C  3.105802 1.121165 1.192366
C  2.837988 -0.245363 0.659379
C  2.942472 0.917728 -0.308532
C  2.035767 1.819091 1.99585
C  4.502213 1.479569 1.640018
C  3.867609 -1.317232 0.637969
C  1.805575 1.432406 -1.091775
C  3.914798 -2.304515 -0.26039
C  -0.53704 1.488714 -1.359652
C  4.967556 -3.367945 -0.197836
C  2.938778 -2.43765 -1.388542
C  -3.3292 0.207687 0.668595
C  -3.30094 -0.703525 -0.305103
C  -4.272956 0.203869 1.812968
C  -4.19687 -1.881422 -0.398991
C  -5.413956 -0.775388 1.530279
C  -4.907266 -2.090511 0.939651
C  -2.267826 1.210571 0.405996
C  -2.224974 -0.342343 -1.260698
H  1.822677 -0.595978 0.823908
H  3.869492 0.990903 -0.86652
H  2.176158 1.602469 3.057042
H  1.025167 1.50973 1.737186
H  2.096628 2.902502 1.873462
H  4.666834 1.170365 2.674586
H  4.653114 2.559806 1.59284
H  5.274215 1.014125 1.027035
H  4.612991 -1.30123 1.428399
H  -0.496182 1.268718 -2.425836
H  -0.62029 2.566801 -1.220937
H  4.51924 -4.359542 -0.092269
H  5.654948 -3.219491 0.635085
H  5.555352 -3.392713 -1.119492
H  3.455981 -2.416862 -2.351665
H  2.181729 -1.655052 -1.400117
H  2.421903 -3.399799 -1.339675
H  -3.734437 -0.079904 2.723176
H  -4.657453 1.210495 1.993734
H  -4.92239 -1.71868 -1.202686
H  -3.628596 -2.770344 -0.683373
H  -5.966022 -0.967254 2.451458
H  -6.119364 -0.313888 0.833331
H  -5.737665 -2.785517 0.807474
H  -4.215322 -2.560951 1.644287
elementType: O N C H
totalener: -1094.87818532 hartree
nucrepener: 2106.57241897 hartree
electener: -3201.45060429 hartree
oneelecener: -5674.83591621 hartree
twoeener: 2473.38531192 hartree
cpcmener: -0.03044724 hartree
kineticenergy: 1090.03618307 hartree
xcener: -105.968803027569 hartree
chargesum: 0.0000000
charge: -0.269331 -0.466060 -0.410031 -0.410274 -0.106921 0.147606 0.008975 -0.113292 -0.261604 -0.294214 -0.309263 0.400351 -0.009895 0.068294 -0.228852 -0.237473 -0.061623 -0.071528 -0.075088 -0.071536 -0.135065 -0.135851 0.312031 0.320015 0.105584 0.092718 0.094313 0.079179 0.100390 0.098680 0.098224 0.092667 0.121871 0.128472 0.139405 0.094850 0.088726 0.094165 0.097143 0.075694 0.099305 0.101779 0.094422 0.100901 0.093746 0.080960 0.078314 0.080981 0.078140
qa: -0.2693 -0.4661 -0.4100 -0.4103 -0.1069 0.1476 0.0090 -0.1133 -0.2616 -0.2942 -0.3093 0.4004 -0.0099 0.0683 -0.2289 -0.2375 -0.0616 -0.0715 -0.0751 -0.0715 -0.1351 -0.1359 0.3120 0.3200 0.1056 0.0927 0.0943 0.0792 0.1004 0.0987 0.0982 0.0927 0.1219 0.1285 0.1394 0.0948 0.0887 0.0942 0.0971 0.0757 0.0993 0.1018 0.0944 0.1009 0.0937 0.0810 0.0783 0.0810 0.0781
va: 2.0847 2.0377 2.1011 2.1043 3.1318 3.7089 3.7848 3.8529 3.8979 3.9132 3.8906 4.1207 3.7048 3.8986 3.9315 3.9373 3.6796 3.6860 3.9220 3.9196 3.9149 3.9164 4.2050 4.2026 1.0195 1.0293 1.0024 1.0137 1.0005 0.9992 1.0027 1.0017 1.0033 1.0093 0.9994 0.9961 1.0067 0.9966 0.9990 1.0202 0.9996 1.0048 1.0149 1.0046 1.0156 1.0097 1.0068 1.0095 1.0067
dispcorr: -0.023721743 hartree
energy: -1094.901907060080
dipole: 13.02990 -14.47079 -1.44089 -13.78630 12.24871 -1.53759 11.88500 -10.35682 1.52818
magnitude: 2.60301 au
magnitude: 6.61634 debye
