program: Orca
programVersion: 5.0.2
elementType: O O O O N C C C C C C C C C C C C C C C C C C C H H H H H H H H H H H H H H H H H H H H H H H H H
charge: 0
multiplicity: 1
keywords: wb97x-d3
keywords: def2-TZVPP
keywords: def2/J RIJCOSX
keywords: DEFGRID2
keywords: scfconv7
keywords: smallprint printgap noloewdin
keywords: NOSOSCF
formula: C19H25NO4
InChI: InChI=1/C19H25NO4/c1-11(2)9-14-15(19(14,3)4)18(23)24-10-20-16(21)12-7-5-6-8-13(12)17(20)22/h9,14-15H,5-8,10H2,1-4H3
49 atoms
O  0.578578 1.441085 -1.483059
O  0.464295 -0.765732 -1.14442
O  -1.506565 2.685265 0.360436
O  -2.448676 -0.902746 -2.268902
N  -1.736342 1.03717 -1.232893
C  2.292311 0.349079 1.279752
C  2.958458 -0.687048 0.429695
C  2.286364 0.494114 -0.234145
C  1.017495 -0.017602 2.002338
C  3.124607 1.361305 2.028426
C  4.427708 -0.861094 0.360671
C  1.039321 0.2837 -0.991727
C  5.058535 -1.753024 -0.409023
C  -0.691672 1.440978 -2.119982
C  6.550902 -1.887942 -0.375044
C  4.359781 -2.686092 -1.351482
C  -3.016547 0.816656 0.669347
C  -3.28829 -0.235855 -0.103027
C  -3.631928 1.08532 1.992365
C  -4.245683 -1.317774 0.232182
C  -4.860945 0.192121 2.172573
C  -4.595047 -1.243945 1.719943
C  -2.010697 1.660159 -0.02244
C  -2.472011 -0.14052 -1.339017
H  2.388843 -1.606633 0.338799
H  2.920296 1.285984 -0.619267
H  0.378655 0.858765 2.133624
H  1.250731 -0.403593 2.996875
H  0.437022 -0.782973 1.488519
H  3.99956 1.6900 1.468036
H  3.471472 0.950669 2.979111
H  2.53046 2.249644 2.251226
H  5.031893 -0.222354 0.997931
H  -0.705199 0.789309 -2.993957
H  -0.839669 2.46797 -2.445661
H  6.987341 -1.68371 -1.356456
H  6.846895 -2.907488 -0.112874
H  7.009926 -1.210738 0.345339
H  3.301141 -2.464082 -1.479495
H  4.445221 -3.722391 -1.010101
H  4.825035 -2.650664 -2.340159
H  -2.893079 0.89141 2.777417
H  -3.89762 2.141455 2.083897
H  -5.14509 -1.206222 -0.38291
H  -3.824936 -2.293218 -0.024598
H  -5.171789 0.203878 3.217713
H  -5.692367 0.604213 1.593757
H  -5.466128 -1.868529 1.92251
H  -3.768565 -1.659919 2.303693
elementType: O N C H
totalener: -1094.87750582 hartree
nucrepener: 2143.73355500 hartree
electener: -3238.61106083 hartree
oneelecener: -5750.04131942 hartree
twoeener: 2511.43025859 hartree
cpcmener: -0.03159179 hartree
kineticenergy: 1090.03381568 hartree
xcener: -105.970150131491 hartree
chargesum: 0.0000000
charge: -0.276892 -0.454043 -0.409466 -0.400765 -0.098042 0.154624 -0.053225 -0.067808 -0.275982 -0.299323 -0.259366 0.381928 -0.023174 0.083487 -0.231857 -0.254829 -0.080354 -0.044802 -0.068102 -0.074501 -0.137644 -0.135388 0.293779 0.302485 0.100841 0.097513 0.091615 0.103988 0.091551 0.088021 0.103341 0.099935 0.120622 0.133423 0.143982 0.094627 0.093074 0.087763 0.081356 0.099387 0.093123 0.100047 0.093642 0.099843 0.093572 0.080490 0.077843 0.080701 0.078960
qa: -0.2769 -0.4540 -0.4095 -0.4008 -0.0980 0.1546 -0.0532 -0.0678 -0.2760 -0.2993 -0.2594 0.3819 -0.0232 0.0835 -0.2319 -0.2548 -0.0804 -0.0448 -0.0681 -0.0745 -0.1376 -0.1354 0.2938 0.3025 0.1008 0.0975 0.0916 0.1040 0.0916 0.0880 0.1033 0.0999 0.1206 0.1334 0.1440 0.0946 0.0931 0.0878 0.0814 0.0994 0.0931 0.1000 0.0936 0.0998 0.0936 0.0805 0.0778 0.0807 0.0790
va: 2.1193 2.0458 2.0994 2.1157 3.0663 3.7615 3.8423 3.8009 3.8804 3.9109 3.8927 4.2001 3.7177 3.8915 3.9312 3.9428 3.6916 3.6294 3.9168 3.9147 3.9182 3.9144 4.1970 4.2159 1.0200 1.0292 1.0084 1.0024 1.0136 1.0025 0.9986 1.0020 1.0062 1.0148 0.9915 0.9961 0.9948 1.0077 1.0190 0.9968 0.9984 1.0058 1.0161 1.0041 1.0160 1.0095 1.0063 1.0095 1.0069
dispcorr: -0.024926624 hartree
energy: -1094.902432445623
dipole: 17.27611 -17.74793 -0.47181 -10.23913 10.40311 0.16398 15.21892 -13.99977 1.21915
magnitude: 1.31751 au
magnitude: 3.34885 debye
