program: Orca
programVersion: 5.0.2
elementType: O O O O N C C C C C C C C C C C C C C C C C C C H H H H H H H H H H H H H H H H H H H H H H H H H
charge: 0
multiplicity: 1
keywords: wb97x-d3
keywords: def2-TZVPP
keywords: def2/J RIJCOSX
keywords: DEFGRID2
keywords: scfconv7
keywords: smallprint printgap noloewdin
keywords: NOSOSCF
formula: C19H25NO4
InChI: InChI=1/C19H25NO4/c1-11(2)9-14-15(19(14,3)4)18(23)24-10-20-16(21)12-7-5-6-8-13(12)17(20)22/h9,14-15H,5-8,10H2,1-4H3
49 atoms
O  0.517657 1.478275 -0.928016
O  1.312111 2.374252 0.970833
O  -1.289264 0.54212 1.590567
O  -2.67665 1.053963 -2.704509
N  -1.756527 1.119784 -0.589254
C  4.038346 1.210259 -0.048763
C  3.439305 0.292582 0.958942
C  2.597053 0.74799 -0.219527
C  4.35052 2.633739 0.341004
C  5.007278 0.649019 -1.061662
C  3.843979 -1.132114 1.079655
C  1.444921 1.625417 0.034916
C  3.007434 -2.156013 1.266369
C  -0.745488 2.109408 -0.778429
C  3.510129 -3.561925 1.388343
C  1.519289 -1.999192 1.353352
C  -3.00409 -0.593413 0.312659
C  -3.416663 -0.436855 -0.945869
C  -3.55026 -1.579724 1.276166
C  -4.490582 -1.227902 -1.595179
C  -4.8752 -2.129524 0.74511
C  -4.799346 -2.462383 -0.745372
C  -1.922466 0.385916 0.577923
C  -2.61637 0.645297 -1.574035
H  3.166253 0.775125 1.895319
H  2.440716 0.01917 -1.006636
H  4.24277 3.308894 -0.510634
H  5.386924 2.69874 0.67954
H  3.723253 3.006577 1.14745
H  6.019835 0.625501 -0.653577
H  5.02966 1.272497 -1.957436
H  4.751212 -0.364039 -1.371796
H  4.910696 -1.336198 1.035626
H  -0.958127 2.651821 -1.697008
H  -0.747005 2.81049 0.053506
H  3.057023 -4.206391 0.630234
H  3.24194 -3.991356 2.357069
H  4.592855 -3.624881 1.279899
H  1.115861 -2.596379 2.174471
H  1.03522 -2.361972 0.441712
H  1.203994 -0.969719 1.509016
H  -2.822578 -2.386594 1.414214
H  -3.681063 -1.121514 2.259723
H  -5.381563 -0.60121 -1.70642
H  -4.196253 -1.513871 -2.608038
H  -5.1555 -3.017801 1.312333
H  -5.664085 -1.390743 0.911788
H  -5.738212 -2.907856 -1.076635
H  -4.021948 -3.214369 -0.908328
elementType: O N C H
totalener: -1094.87808066 hartree
nucrepener: 2120.85076291 hartree
electener: -3215.72884356 hartree
oneelecener: -5704.05007784 hartree
twoeener: 2488.32123428 hartree
cpcmener: -0.03093821 hartree
kineticenergy: 1090.04145867 hartree
xcener: -105.971271644689 hartree
chargesum: -0.0000000
charge: -0.285429 -0.457063 -0.411464 -0.408982 -0.091613 0.147019 -0.005231 -0.114313 -0.282552 -0.282625 -0.307740 0.388463 -0.003921 0.078793 -0.229377 -0.236716 -0.050294 -0.084345 -0.074924 -0.069782 -0.133564 -0.137343 0.306237 0.321618 0.105176 0.094952 0.098816 0.093603 0.094462 0.098129 0.097920 0.092520 0.121068 0.124539 0.139482 0.094311 0.096505 0.088658 0.101549 0.102343 0.075012 0.101069 0.094155 0.100246 0.093062 0.080931 0.077650 0.081004 0.077985
qa: -0.2854 -0.4571 -0.4115 -0.4090 -0.0916 0.1470 -0.0052 -0.1143 -0.2826 -0.2826 -0.3077 0.3885 -0.0039 0.0788 -0.2294 -0.2367 -0.0503 -0.0843 -0.0749 -0.0698 -0.1336 -0.1373 0.3062 0.3216 0.1052 0.0950 0.0988 0.0936 0.0945 0.0981 0.0979 0.0925 0.1211 0.1245 0.1395 0.0943 0.0965 0.0887 0.1015 0.1023 0.0750 0.1011 0.0942 0.1002 0.0931 0.0809 0.0777 0.0810 0.0780
va: 2.1036 2.0492 2.0988 2.1100 3.0960 3.6981 3.7998 3.8041 3.8953 3.9075 3.8984 4.1654 3.7133 3.8648 3.9329 3.9397 3.6635 3.6960 3.9229 3.9180 3.9133 3.9179 4.2058 4.2233 1.0258 1.0308 0.9990 1.0009 1.0183 1.0004 1.0030 1.0025 1.0043 1.0158 1.0163 0.9960 0.9962 1.0065 1.0017 0.9971 1.0125 1.0051 1.0155 1.0046 1.0158 1.0096 1.0069 1.0094 1.0066
dispcorr: -0.024267393 hartree
energy: -1094.902348048883
dipole: 14.76299 -15.70412 -0.94113 -17.24104 15.37782 -1.86322 4.62428 -5.06055 -0.43627
magnitude: 2.13252 au
magnitude: 5.42043 debye
