program: Orca
programVersion: 5.0.2
elementType: O O O O N C C C C C C C C C C C C C C C C C C C H H H H H H H H H H H H H H H H H H H H H H H H H
charge: 0
multiplicity: 1
keywords: wb97x-d3
keywords: def2-TZVPP
keywords: def2/J RIJCOSX
keywords: DEFGRID2
keywords: scfconv7
keywords: smallprint printgap noloewdin
keywords: NOSOSCF
formula: C19H25NO4
InChI: InChI=1/C19H25NO4/c1-11(2)9-14-15(19(14,3)4)18(23)24-10-20-16(21)12-7-5-6-8-13(12)17(20)22/h9,14-15H,5-8,10H2,1-4H3
49 atoms
O  0.448175 1.707982 -0.166123
O  1.589764 1.685724 1.766929
O  -3.04289 2.233689 -1.350841
O  -1.006797 -0.442185 1.702949
N  -1.774807 1.183279 0.265464
C  4.045809 1.232118 -0.142614
C  3.618025 -0.061426 0.455651
C  2.582833 0.815055 -0.226884
C  4.476565 2.356079 0.766483
C  4.782874 1.218694 -1.460295
C  3.990553 -1.372851 -0.136119
C  1.530007 1.44096 0.587362
C  3.186607 -2.435987 -0.216342
C  -0.745179 2.151957 0.462505
C  3.656375 -3.724045 -0.819996
C  1.770196 -2.43619 0.270963
C  -3.593036 0.020138 -0.536745
C  -2.997337 -0.766629 0.359952
C  -4.819634 -0.327237 -1.294893
C  -3.465804 -2.116311 0.758559
C  -5.098852 -1.825605 -1.158477
C  -4.903295 -2.318305 0.275741
C  -2.823228 1.286245 -0.641792
C  -1.808515 -0.05558 0.891141
H  3.544733 -0.047815 1.541045
H  2.256353 0.493187 -1.209334
H  4.248958 3.329423 0.326738
H  5.55745 2.309806 0.914457
H  4.014232 2.314607 1.74999
H  5.854253 1.078236 -1.301445
H  4.650177 2.167644 -1.983609
H  4.43974 0.425976 -2.125478
H  5.008376 -1.464442 -0.506354
H  -1.050878 3.083111 -0.010178
H  -0.594385 2.328451 1.52539
H  3.607927 -4.538823 -0.092745
H  4.681716 -3.658742 -1.184283
H  3.019042 -4.020391 -1.657437
H  1.070897 -2.507062 -0.567196
H  1.513673 -1.549244 0.845674
H  1.580655 -3.307521 0.902673
H  -5.659084 0.260276 -0.908928
H  -4.713126 -0.043868 -2.34487
H  -2.800702 -2.870673 0.325191
H  -3.394625 -2.240424 1.841846
H  -6.115669 -2.038239 -1.490772
H  -4.43052 -2.378213 -1.82456
H  -5.168098 -3.374035 0.34734
H  -5.58477 -1.779345 0.939992
elementType: O N C H
totalener: -1094.87819622 hartree
nucrepener: 2112.39902718 hartree
electener: -3207.27722340 hartree
oneelecener: -5687.16020654 hartree
twoeener: 2479.88298313 hartree
cpcmener: -0.03043549 hartree
kineticenergy: 1090.03736937 hartree
xcener: -105.970526749612 hartree
chargesum: 0.0000000
charge: -0.284943 -0.458365 -0.409202 -0.414408 -0.090906 0.150671 -0.005962 -0.118618 -0.281357 -0.283658 -0.304906 0.392126 -0.005970 0.078895 -0.229148 -0.234754 -0.083337 -0.057024 -0.072096 -0.073508 -0.136899 -0.134544 0.322149 0.315825 0.104384 0.094239 0.098742 0.094050 0.093762 0.098363 0.097740 0.093102 0.121300 0.124145 0.140064 0.096341 0.088692 0.093774 0.100792 0.072587 0.101012 0.101013 0.093592 0.101061 0.093235 0.080891 0.078195 0.080583 0.078282
qa: -0.2849 -0.4584 -0.4092 -0.4144 -0.0909 0.1507 -0.0060 -0.1186 -0.2814 -0.2837 -0.3049 0.3921 -0.0060 0.0789 -0.2291 -0.2348 -0.0833 -0.0570 -0.0721 -0.0735 -0.1369 -0.1345 0.3221 0.3158 0.1044 0.0942 0.0987 0.0940 0.0938 0.0984 0.0977 0.0931 0.1213 0.1241 0.1401 0.0963 0.0887 0.0938 0.1008 0.0726 0.1010 0.1010 0.0936 0.1011 0.0932 0.0809 0.0782 0.0806 0.0783
va: 2.1020 2.0494 2.1106 2.0961 3.0968 3.6970 3.8057 3.8047 3.8954 3.9081 3.8997 4.1600 3.7122 3.8580 3.9322 3.9410 3.6950 3.6697 3.9179 3.9234 3.9170 3.9145 4.2246 4.2014 1.0260 1.0316 0.9991 1.0011 1.0183 1.0000 1.0031 1.0020 1.0041 1.0162 1.0167 0.9963 1.0064 0.9963 0.9979 1.0141 1.0014 1.0048 1.0155 1.0049 1.0158 1.0094 1.0065 1.0097 1.0068
dispcorr: -0.024008469 hartree
energy: -1094.902204688032
dipole: 14.58797 -15.70882 -1.12086 -16.70665 15.25337 -1.45328 -6.06543 4.95217 -1.11326
magnitude: 2.14655 au
magnitude: 5.45610 debye
