program: Orca
programVersion: 5.0.2
elementType: O O O O N C C C C C C C C C C C C C C C C C C C H H H H H H H H H H H H H H H H H H H H H H H H H
charge: 0
multiplicity: 1
keywords: wb97x-d3
keywords: def2-TZVPP
keywords: def2/J RIJCOSX
keywords: DEFGRID2
keywords: scfconv7
keywords: smallprint printgap noloewdin
keywords: NOSOSCF
formula: C19H25NO4
InChI: InChI=1/C19H25NO4/c1-11(2)9-14-15(19(14,3)4)18(23)24-10-20-16(21)12-7-5-6-8-13(12)17(20)22/h9,14-15H,5-8,10H2,1-4H3
49 atoms
O  0.274868 1.266174 0.13833
O  1.565457 1.245989 -1.695549
O  -2.894558 2.494449 1.429662
O  -1.645644 -0.424939 -1.817142
N  -1.990876 1.288319 -0.318004
C  2.589705 -1.389548 -0.303412
C  3.619196 -0.304501 -0.192439
C  2.192497 -0.022776 0.233087
C  2.148442 -1.828017 -1.678277
C  2.57494 -2.51711 0.699731
C  4.685649 -0.330607 0.826859
C  1.349571 0.882971 -0.56596
C  5.976944 -0.03659 0.641486
C  -0.764773 1.987039 -0.512061
C  6.952082 -0.134074 1.776805
C  6.583095 0.392266 -0.660278
C  -3.964017 0.501704 0.568444
C  -3.59168 -0.366784 -0.372913
C  -5.204223 0.408306 1.375981
C  -4.341047 -1.590449 -0.74826
C  -6.14273 -0.626701 0.752427
C  -5.396052 -1.887559 0.319343
C  -2.933125 1.565182 0.66565
C  -2.310682 0.098276 -0.959815
H  3.887614 0.1407 -1.144427
H  1.998689 0.006075 1.299899
H  1.096176 -2.121541 -1.678336
H  2.730939 -2.69862 -1.986509
H  2.283824 -1.063614 -2.440212
H  3.307731 -3.280067 0.428408
H  1.593322 -2.994677 0.717968
H  2.796103 -2.190973 1.715182
H  4.381894 -0.628876 1.826159
H  -0.56544 2.102559 -1.575488
H  -0.844116 2.972797 -0.05764
H  7.399703 0.838924 1.99754
H  7.780156 -0.802984 1.526366
H  6.486877 -0.504499 2.690515
H  7.268946 -0.373222 -1.03361
H  7.178866 1.298434 -0.525448
H  5.854415 0.589958 -1.444113
H  -4.94725 0.13258 2.403915
H  -5.689075 1.385495 1.440433
H  -4.809747 -1.442049 -1.726504
H  -3.657109 -2.434039 -0.868044
H  -6.928395 -0.882559 1.464609
H  -6.639684 -0.184404 -0.115802
H  -6.101332 -2.627974 -0.060744
H  -4.909774 -2.337103 1.189876
elementType: O N C H
totalener: -1094.88018544 hartree
nucrepener: 2061.16316511 hartree
electener: -3156.04335054 hartree
oneelecener: -5584.60764589 hartree
twoeener: 2428.56429535 hartree
cpcmener: -0.03102913 hartree
kineticenergy: 1090.04028535 hartree
xcener: -105.971515854643 hartree
chargesum: 0.0000000
charge: -0.280302 -0.454549 -0.409162 -0.413499 -0.098414 0.103503 0.029657 -0.086332 -0.273746 -0.270286 -0.271829 0.386340 -0.050017 0.082137 -0.216780 -0.251966 -0.082256 -0.055075 -0.074238 -0.071246 -0.135002 -0.135877 0.324566 0.313739 0.094711 0.090538 0.093197 0.097356 0.093840 0.097392 0.097243 0.087503 0.115040 0.138880 0.124508 0.093961 0.090977 0.087392 0.098604 0.092358 0.090197 0.101595 0.094031 0.100389 0.093584 0.080925 0.077856 0.080542 0.078014
qa: -0.2803 -0.4545 -0.4092 -0.4135 -0.0984 0.1035 0.0297 -0.0863 -0.2737 -0.2703 -0.2718 0.3863 -0.0500 0.0821 -0.2168 -0.2520 -0.0823 -0.0551 -0.0742 -0.0712 -0.1350 -0.1359 0.3246 0.3137 0.0947 0.0905 0.0932 0.0974 0.0938 0.0974 0.0972 0.0875 0.1150 0.1389 0.1245 0.0940 0.0910 0.0874 0.0986 0.0924 0.0902 0.1016 0.0940 0.1004 0.0936 0.0809 0.0779 0.0805 0.0780
va: 2.1087 2.0571 2.1090 2.0985 3.0959 3.6949 3.7922 3.8150 3.9014 3.9115 3.8768 4.1904 3.7670 3.8592 3.9216 3.9402 3.6962 3.6565 3.9201 3.9186 3.9137 3.9148 4.2241 4.2145 1.0292 1.0344 1.0057 1.0010 1.0176 1.0016 1.0017 1.0070 1.0119 1.0182 1.0129 0.9965 0.9961 1.0089 0.9964 0.9974 1.0109 1.0053 1.0153 1.0049 1.0155 1.0097 1.0067 1.0094 1.0068
dispcorr: -0.022388019 hartree
energy: -1094.902573455659
dipole: 19.72277 -20.99623 -1.27347 -16.79558 15.49316 -1.30241 4.40741 -3.45078 0.95663
magnitude: 2.05746 au
magnitude: 5.22964 debye
